View Issue Details

IDProjectCategoryLast Update
0019630Starward Rogue[All Projects] Crash/ExceptionJul 2, 2018 1:59 pm
ReporterpatsanchegAssigned Tox4000Bughunter 
Severitycrash 
Status resolvedResolutionfixed 
Product Version2.003 Hotfix 
Fixed in Version 
Summary0019630: Crash (memory leak?)
DescriptionThere is definitely a memory leak is going on in Starward Rogue. If I play the whole run in one go, the game will always crash around floor 5-6 at the beginning of a new floor. But if I quit the game completely after every 2 floors and launch it again, then there are no crashes whatsoever.
In this current situation: I completed a run at floor 7, started a new run, and the game crashed upon entering floor 2.
error.log and output_log.txt are attached
crash.dmp is 0 bytes
TagsNo tags attached.

Activities

patsancheg

Jun 4, 2018 8:06 am

reporter  

error.log (53,872 bytes)
output_log.txt (43,980 bytes)
Initialize engine version: 2017.1.0p4 (892c0f8d8f8a)
GfxDevice: creating device client; threaded=1
Direct3D:
    Version:  Direct3D 9.0c [igdumdim32.dll 23.20.16.4973]
    Renderer: Intel(R) HD Graphics 630
    Vendor:   Intel
    VRAM:     2111 MB (via DXGI)
    Caps:     Shader=30 DepthRT=1 NativeDepth=1 NativeShadow=1 DF16=1 INTZ=1 NULL=1 RESZ=1 SlowINTZ=0 ATOC=1 BC4=1 BC5=1
Begin MonoManager ReloadAssembly
Platform assembly: C:\Steam\steamapps\common\Starward Rogue\StarwardRogue_Data\Managed\UnityEngine.dll (this message is harmless)
Loading C:\Steam\steamapps\common\Starward Rogue\StarwardRogue_Data\Managed\UnityEngine.dll into Unity Child Domain
Platform assembly: C:\Steam\steamapps\common\Starward Rogue\StarwardRogue_Data\Managed\I18N.dll (this message is harmless)
Platform assembly: C:\Steam\steamapps\common\Starward Rogue\StarwardRogue_Data\Managed\I18N.Other.dll (this message is harmless)
Platform assembly: C:\Steam\steamapps\common\Starward Rogue\StarwardRogue_Data\Managed\Assembly-CSharp.dll (this message is harmless)
Loading C:\Steam\steamapps\common\Starward Rogue\StarwardRogue_Data\Managed\Assembly-CSharp.dll into Unity Child Domain
Platform assembly: C:\Steam\steamapps\common\Starward Rogue\StarwardRogue_Data\Managed\UnityEngine.UI.dll (this message is harmless)
Loading C:\Steam\steamapps\common\Starward Rogue\StarwardRogue_Data\Managed\UnityEngine.UI.dll into Unity Child Domain
Platform assembly: C:\Steam\steamapps\common\Starward Rogue\StarwardRogue_Data\Managed\UnityEngine.Networking.dll (this message is harmless)
Loading C:\Steam\steamapps\common\Starward Rogue\StarwardRogue_Data\Managed\UnityEngine.Networking.dll into Unity Child Domain
Platform assembly: C:\Steam\steamapps\common\Starward Rogue\StarwardRogue_Data\Managed\UnityEngine.Timeline.dll (this message is harmless)
Loading C:\Steam\steamapps\common\Starward Rogue\StarwardRogue_Data\Managed\UnityEngine.Timeline.dll into Unity Child Domain
Platform assembly: C:\Steam\steamapps\common\Starward Rogue\StarwardRogue_Data\Managed\Ionic.Zip.Reduced.dll (this message is harmless)
Loading C:\Steam\steamapps\common\Starward Rogue\StarwardRogue_Data\Managed\Ionic.Zip.Reduced.dll into Unity Child Domain
Platform assembly: C:\Steam\steamapps\common\Starward Rogue\StarwardRogue_Data\Managed\ExcelLibrary.dll (this message is harmless)
Loading C:\Steam\steamapps\common\Starward Rogue\StarwardRogue_Data\Managed\ExcelLibrary.dll into Unity Child Domain
Platform assembly: C:\Steam\steamapps\common\Starward Rogue\StarwardRogue_Data\Managed\I18N.CJK.dll (this message is harmless)
Loading C:\Steam\steamapps\common\Starward Rogue\StarwardRogue_Data\Managed\I18N.CJK.dll into Unity Child Domain
Platform assembly: C:\Steam\steamapps\common\Starward Rogue\StarwardRogue_Data\Managed\I18N.dll (this message is harmless)
Loading C:\Steam\steamapps\common\Starward Rogue\StarwardRogue_Data\Managed\I18N.dll into Unity Child Domain
Platform assembly: C:\Steam\steamapps\common\Starward Rogue\StarwardRogue_Data\Managed\I18N.MidEast.dll (this message is harmless)
Loading C:\Steam\steamapps\common\Starward Rogue\StarwardRogue_Data\Managed\I18N.MidEast.dll into Unity Child Domain
Platform assembly: C:\Steam\steamapps\common\Starward Rogue\StarwardRogue_Data\Managed\I18N.Other.dll (this message is harmless)
Loading C:\Steam\steamapps\common\Starward Rogue\StarwardRogue_Data\Managed\I18N.Other.dll into Unity Child Domain
Platform assembly: C:\Steam\steamapps\common\Starward Rogue\StarwardRogue_Data\Managed\I18N.Rare.dll (this message is harmless)
Loading C:\Steam\steamapps\common\Starward Rogue\StarwardRogue_Data\Managed\I18N.Rare.dll into Unity Child Domain
Platform assembly: C:\Steam\steamapps\common\Starward Rogue\StarwardRogue_Data\Managed\I18N.West.dll (this message is harmless)
Loading C:\Steam\steamapps\common\Starward Rogue\StarwardRogue_Data\Managed\I18N.West.dll into Unity Child Domain
Platform assembly: C:\Steam\steamapps\common\Starward Rogue\StarwardRogue_Data\Managed\System.Drawing.dll (this message is harmless)
Loading C:\Steam\steamapps\common\Starward Rogue\StarwardRogue_Data\Managed\System.Drawing.dll into Unity Child Domain
Platform assembly: C:\Steam\steamapps\common\Starward Rogue\StarwardRogue_Data\Managed\Steamworks.NET.dll (this message is harmless)
Loading C:\Steam\steamapps\common\Starward Rogue\StarwardRogue_Data\Managed\Steamworks.NET.dll into Unity Child Domain
Platform assembly: C:\Steam\steamapps\common\Starward Rogue\StarwardRogue_Data\Managed\Steamworks.NET.dll (this message is harmless)
Loading C:\Steam\steamapps\common\Starward Rogue\StarwardRogue_Data\Managed\Steamworks.NET.dll into Unity Child Domain
Platform assembly: C:\Steam\steamapps\common\Starward Rogue\StarwardRogue_Data\Managed\System.dll (this message is harmless)
Platform assembly: C:\Steam\steamapps\common\Starward Rogue\StarwardRogue_Data\Managed\System.Core.dll (this message is harmless)
- Completed reload, in  0.088 seconds
WARNING: Shader Unsupported: 'Hidden/VR/BlitCopyFromTexArray' - Pass '' has no vertex shader
WARNING: Shader Unsupported: 'Hidden/VR/BlitCopyFromTexArray' - Setting to default shader.
<RI> Initializing input.

<RI> Input initialized.

<RI> Initialized touch support.

UnloadTime: 1.249707 ms
Fallback handler could not load library C:/Steam/steamapps/common/Starward Rogue/StarwardRogue_Data/Mono/XInputInterface64
Fallback handler could not load library C:/Steam/steamapps/common/Starward Rogue/StarwardRogue_Data/Mono/.\XInputInterface64
Fallback handler could not load library C:/Steam/steamapps/common/Starward Rogue/StarwardRogue_Data/Mono/XInputInterface64
Fallback handler could not load library C:/Steam/steamapps/common/Starward Rogue/StarwardRogue_Data/Mono/libXInputInterface64
Fallback handler could not load library C:/Steam/steamapps/common/Starward Rogue/StarwardRogue_Data/Mono/.\libXInputInterface64
Fallback handler could not load library C:/Steam/steamapps/common/Starward Rogue/StarwardRogue_Data/Mono/libXInputInterface64
Steamworks Init
 
(Filename: C:/buildslave/unity/build/artifacts/generated/common/runtime/DebugBindings.gen.cpp Line: 51)

Steamworks IsRunning: True
 
(Filename: C:/buildslave/unity/build/artifacts/generated/common/runtime/DebugBindings.gen.cpp Line: 51)

graphicsShaderLevel:30
graphicsDeviceID:22802
graphicsDeviceName:Intel(R) HD Graphics 630
graphicsDeviceVendor:Intel
graphicsDeviceVendorID:32902
graphicsDeviceVersion:Direct3D 9.0c [igdumdim32.dll 23.20.16.4973]
graphicsMemorySize:2111
graphicsMultiThreaded:True
operatingSystem:Windows 10  (10.0.0) 64bit
processorCount:4
processorType:Intel(R) Core(TM) i5-7400T CPU @ 2.40GHz
processorFrequency:2400 mHz
supportsImageEffects:True
supportsShadows:True
maxTextureSize:8192
npotSupport:Full
systemMemorySize:8084
 
(Filename: C:/buildslave/unity/build/artifacts/generated/common/runtime/DebugBindings.gen.cpp Line: 51)

Platform assembly: C:\Steam\steamapps\common\Starward Rogue\StarwardRogue_Data\Managed\System.Xml.dll (this message is harmless)
Steamworks Init
 
(Filename: C:/buildslave/unity/build/artifacts/generated/common/runtime/DebugBindings.gen.cpp Line: 51)

Steamworks IsRunning: True
 
(Filename: C:/buildslave/unity/build/artifacts/generated/common/runtime/DebugBindings.gen.cpp Line: 51)

GameInit (0 - 6/4/2018 12:24:11 PM)
 
(Filename: C:/buildslave/unity/build/artifacts/generated/common/runtime/DebugBindings.gen.cpp Line: 51)

Expansion 1 music installed.
 
(Filename: C:/buildslave/unity/build/artifacts/generated/common/runtime/DebugBindings.gen.cpp Line: 51)

PerfectClearBoss_CrystalMother:Installed
 
(Filename: C:/buildslave/unity/build/artifacts/generated/common/runtime/DebugBindings.gen.cpp Line: 51)

PerfectClearBoss_Battleswarm:Installed
 
(Filename: C:/buildslave/unity/build/artifacts/generated/common/runtime/DebugBindings.gen.cpp Line: 51)

PerfectClearBoss_WallMaster:Installed
 
(Filename: C:/buildslave/unity/build/artifacts/generated/common/runtime/DebugBindings.gen.cpp Line: 51)

PerfectClearBoss_Mirror:Installed
 
(Filename: C:/buildslave/unity/build/artifacts/generated/common/runtime/DebugBindings.gen.cpp Line: 51)

PerfectClearBoss_Backfire:Installed
 
(Filename: C:/buildslave/unity/build/artifacts/generated/common/runtime/DebugBindings.gen.cpp Line: 51)

PerfectClearBoss_ShrapnelRose:Installed
 
(Filename: C:/buildslave/unity/build/artifacts/generated/common/runtime/DebugBindings.gen.cpp Line: 51)

PerfectClearBoss_LadyStaccato:Installed
 
(Filename: C:/buildslave/unity/build/artifacts/generated/common/runtime/DebugBindings.gen.cpp Line: 51)

PerfectClearBoss_Labyrinth:Installed
 
(Filename: C:/buildslave/unity/build/artifacts/generated/common/runtime/DebugBindings.gen.cpp Line: 51)

PerfectClearBoss_Aggressor:Installed
 
(Filename: C:/buildslave/unity/build/artifacts/generated/common/runtime/DebugBindings.gen.cpp Line: 51)

PerfectClearBoss_Centrifuge:Installed
 
(Filename: C:/buildslave/unity/build/artifacts/generated/common/runtime/DebugBindings.gen.cpp Line: 51)

PerfectClearBoss_Vestige:Installed
 
(Filename: C:/buildslave/unity/build/artifacts/generated/common/runtime/DebugBindings.gen.cpp Line: 51)

PerfectClearBoss_Fusillade:Installed
 
(Filename: C:/buildslave/unity/build/artifacts/generated/common/runtime/DebugBindings.gen.cpp Line: 51)

PerfectClearBoss_Aberration:Installed
 
(Filename: C:/buildslave/unity/build/artifacts/generated/common/runtime/DebugBindings.gen.cpp Line: 51)

PerfectClearBoss_TheWarden:Installed
 
(Filename: C:/buildslave/unity/build/artifacts/generated/common/runtime/DebugBindings.gen.cpp Line: 51)

PerfectClearBoss_Terminus:Installed
 
(Filename: C:/buildslave/unity/build/artifacts/generated/common/runtime/DebugBindings.gen.cpp Line: 51)

PerfectClearAllBosses:Installed
 
(Filename: C:/buildslave/unity/build/artifacts/generated/common/runtime/DebugBindings.gen.cpp Line: 51)

PerfectClearAllMinibosses:Installed
 
(Filename: C:/buildslave/unity/build/artifacts/generated/common/runtime/DebugBindings.gen.cpp Line: 51)

ClearAllCondemnedBosses:Installed
 
(Filename: C:/buildslave/unity/build/artifacts/generated/common/runtime/DebugBindings.gen.cpp Line: 51)

CompleteAFloorWithNoDamage:Installed
 
(Filename: C:/buildslave/unity/build/artifacts/generated/common/runtime/DebugBindings.gen.cpp Line: 51)

CompleteARunWithoutBuyingItems:Installed
 
(Filename: C:/buildslave/unity/build/artifacts/generated/common/runtime/DebugBindings.gen.cpp Line: 51)

CompleteARunWithoutPickingUpAttachment:Installed
 
(Filename: C:/buildslave/unity/build/artifacts/generated/common/runtime/DebugBindings.gen.cpp Line: 51)

UnlockAllItems:Installed
 
(Filename: C:/buildslave/unity/build/artifacts/generated/common/runtime/DebugBindings.gen.cpp Line: 51)

FindAllItems:Installed
 
(Filename: C:/buildslave/unity/build/artifacts/generated/common/runtime/DebugBindings.gen.cpp Line: 51)

Kill1OfEveryRegualrEnemy:Installed
 
(Filename: C:/buildslave/unity/build/artifacts/generated/common/runtime/DebugBindings.gen.cpp Line: 51)

KillFinalBossWithMech_Blue:Installed
 
(Filename: C:/buildslave/unity/build/artifacts/generated/common/runtime/DebugBindings.gen.cpp Line: 51)

KillFinalBossWithMech_Green:Installed
 
(Filename: C:/buildslave/unity/build/artifacts/generated/common/runtime/DebugBindings.gen.cpp Line: 51)

KillFinalBossWithMech_Orange:Installed
 
(Filename: C:/buildslave/unity/build/artifacts/generated/common/runtime/DebugBindings.gen.cpp Line: 51)

KillFinalBossWithMech_PortalTip:Installed
 
(Filename: C:/buildslave/unity/build/artifacts/generated/common/runtime/DebugBindings.gen.cpp Line: 51)

KillFinalBossWithMech_RedBlack:Installed
 
(Filename: C:/buildslave/unity/build/artifacts/generated/common/runtime/DebugBindings.gen.cpp Line: 51)

KillFinalBossWithMech_White:Installed
 
(Filename: C:/buildslave/unity/build/artifacts/generated/common/runtime/DebugBindings.gen.cpp Line: 51)

KillFinalBossWithAllMechs:Installed
 
(Filename: C:/buildslave/unity/build/artifacts/generated/common/runtime/DebugBindings.gen.cpp Line: 51)

KillSuperFinalBossWithMech_Blue:Installed
 
(Filename: C:/buildslave/unity/build/artifacts/generated/common/runtime/DebugBindings.gen.cpp Line: 51)

KillSuperFinalBossWithMech_Green:Installed
 
(Filename: C:/buildslave/unity/build/artifacts/generated/common/runtime/DebugBindings.gen.cpp Line: 51)

KillSuperFinalBossWithMech_Orange:Installed
 
(Filename: C:/buildslave/unity/build/artifacts/generated/common/runtime/DebugBindings.gen.cpp Line: 51)

KillSuperFinalBossWithMech_PortalTip:Installed
 
(Filename: C:/buildslave/unity/build/artifacts/generated/common/runtime/DebugBindings.gen.cpp Line: 51)

KillSuperFinalBossWithMech_RedBlack:Installed
 
(Filename: C:/buildslave/unity/build/artifacts/generated/common/runtime/DebugBindings.gen.cpp Line: 51)

KillSuperFinalBossWithMech_White:Installed
 
(Filename: C:/buildslave/unity/build/artifacts/generated/common/runtime/DebugBindings.gen.cpp Line: 51)

KillSuperFinalBossWithAllMechs:Installed
 
(Filename: C:/buildslave/unity/build/artifacts/generated/common/runtime/DebugBindings.gen.cpp Line: 51)

KillShopkeeper:Installed
 
(Filename: C:/buildslave/unity/build/artifacts/generated/common/runtime/DebugBindings.gen.cpp Line: 51)

Have5FamiliarsAtOnce:Installed
 
(Filename: C:/buildslave/unity/build/artifacts/generated/common/runtime/DebugBindings.gen.cpp Line: 51)

CompleteARunWithIncredibility_LifeHarvester:Installed
 
(Filename: C:/buildslave/unity/build/artifacts/generated/common/runtime/DebugBindings.gen.cpp Line: 51)

CompleteARunWithIncredibility_ConsummateConsumer:Installed
 
(Filename: C:/buildslave/unity/build/artifacts/generated/common/runtime/DebugBindings.gen.cpp Line: 51)

CompleteARunWithIncredibility_Minimalist:Installed
 
(Filename: C:/buildslave/unity/build/artifacts/generated/common/runtime/DebugBindings.gen.cpp Line: 51)

CompleteARunWithIncredibility_TheOne:Installed
 
(Filename: C:/buildslave/unity/build/artifacts/generated/common/runtime/DebugBindings.gen.cpp Line: 51)

CompleteARunWithIncredibility_MagneticPersonality:Installed
 
(Filename: C:/buildslave/unity/build/artifacts/generated/common/runtime/DebugBindings.gen.cpp Line: 51)

CompleteARunWithIncredibility_Jaywalker:Installed
 
(Filename: C:/buildslave/unity/build/artifacts/generated/common/runtime/DebugBindings.gen.cpp Line: 51)

CompleteARunWithIncredibility_Confidence:Installed
 
(Filename: C:/buildslave/unity/build/artifacts/generated/common/runtime/DebugBindings.gen.cpp Line: 51)

CompleteARunWithIncredibility_RiskyAssassin:Installed
 
(Filename: C:/buildslave/unity/build/artifacts/generated/common/runtime/DebugBindings.gen.cpp Line: 51)

PerfectClearBoss_Invader:Installed
 
(Filename: C:/buildslave/unity/build/artifacts/generated/common/runtime/DebugBindings.gen.cpp Line: 51)

X1_PerfectClearBoss_Meridian:Installed
 
(Filename: C:/buildslave/unity/build/artifacts/generated/common/runtime/DebugBindings.gen.cpp Line: 51)

X1_PerfectClearBoss_Rive:Installed
 
(Filename: C:/buildslave/unity/build/artifacts/generated/common/runtime/DebugBindings.gen.cpp Line: 51)

X1_PerfectClearBoss_CircuitRondure:Installed
 
(Filename: C:/buildslave/unity/build/artifacts/generated/common/runtime/DebugBindings.gen.cpp Line: 51)

X1_PerfectClearBoss_Pandemonium:Installed
 
(Filename: C:/buildslave/unity/build/artifacts/generated/common/runtime/DebugBindings.gen.cpp Line: 51)

X1_PerfectClearBoss_Ent_Enemy_Reanimator:Installed
 
(Filename: C:/buildslave/unity/build/artifacts/generated/common/runtime/DebugBindings.gen.cpp Line: 51)

X1_PerfectClearBoss_Recast:Installed
 
(Filename: C:/buildslave/unity/build/artifacts/generated/common/runtime/DebugBindings.gen.cpp Line: 51)

X1_PerfectClearBoss_Nova:Installed
 
(Filename: C:/buildslave/unity/build/artifacts/generated/common/runtime/DebugBindings.gen.cpp Line: 51)

X1_PerfectClearBoss_CarrionEngine:Installed
 
(Filename: C:/buildslave/unity/build/artifacts/generated/common/runtime/DebugBindings.gen.cpp Line: 51)

X1_PerfectClearBoss_Javelin:Installed
 
(Filename: C:/buildslave/unity/build/artifacts/generated/common/runtime/DebugBindings.gen.cpp Line: 51)

X1_PerfectClearAllExpansion1Bosses:Installed
 
(Filename: C:/buildslave/unity/build/artifacts/generated/common/runtime/DebugBindings.gen.cpp Line: 51)

X1_KillFinalBossWithMech_Zephyr:Installed
 
(Filename: C:/buildslave/unity/build/artifacts/generated/common/runtime/DebugBindings.gen.cpp Line: 51)

X1_KillFinalBossWithMech_Warhog:Installed
 
(Filename: C:/buildslave/unity/build/artifacts/generated/common/runtime/DebugBindings.gen.cpp Line: 51)

X1_KillFinalBossWithMech_Paladin:Installed
 
(Filename: C:/buildslave/unity/build/artifacts/generated/common/runtime/DebugBindings.gen.cpp Line: 51)

X1_KillSuperFinalBossWithMech_Zephyr:Installed
 
(Filename: C:/buildslave/unity/build/artifacts/generated/common/runtime/DebugBindings.gen.cpp Line: 51)

X1_KillSuperFinalBossWithMech_Warhog:Installed
 
(Filename: C:/buildslave/unity/build/artifacts/generated/common/runtime/DebugBindings.gen.cpp Line: 51)

X1_KillSuperFinalBossWithMech_Paladin:Installed
 
(Filename: C:/buildslave/unity/build/artifacts/generated/common/runtime/DebugBindings.gen.cpp Line: 51)

KillFinalBossWithMech_Humble:Installed
 
(Filename: C:/buildslave/unity/build/artifacts/generated/common/runtime/DebugBindings.gen.cpp Line: 51)

KillFinalBossWithMech_Alpha:Installed
 
(Filename: C:/buildslave/unity/build/artifacts/generated/common/runtime/DebugBindings.gen.cpp Line: 51)

KillFinalBossWithMech_Penumbra:Installed
 
(Filename: C:/buildslave/unity/build/artifacts/generated/common/runtime/DebugBindings.gen.cpp Line: 51)

KillSuperFinalBossWithMech_Humble:Installed
 
(Filename: C:/buildslave/unity/build/artifacts/generated/common/runtime/DebugBindings.gen.cpp Line: 51)

KillSuperFinalBossWithMech_Alpha:Installed
 
(Filename: C:/buildslave/unity/build/artifacts/generated/common/runtime/DebugBindings.gen.cpp Line: 51)

KillSuperFinalBossWithMech_Penumbra:Installed
 
(Filename: C:/buildslave/unity/build/artifacts/generated/common/runtime/DebugBindings.gen.cpp Line: 51)

GameInit (1 - 6/4/2018 12:24:19 PM)
 
(Filename: C:/buildslave/unity/build/artifacts/generated/common/runtime/DebugBindings.gen.cpp Line: 51)

Version: 2.003
 
(Filename: C:/buildslave/unity/build/artifacts/generated/common/runtime/DebugBindings.gen.cpp Line: 51)

SoundsFromMods sound file count: 1
 
(Filename: C:/buildslave/unity/build/artifacts/generated/common/runtime/DebugBindings.gen.cpp Line: 51)

SoundsFromMods sound loading finished
 
(Filename: C:/buildslave/unity/build/artifacts/generated/common/runtime/DebugBindings.gen.cpp Line: 51)

GameInit (2 - 6/4/2018 12:24:23 PM)
 
(Filename: C:/buildslave/unity/build/artifacts/generated/common/runtime/DebugBindings.gen.cpp Line: 51)

GameInit (3 - 6/4/2018 12:24:25 PM)
 
(Filename: C:/buildslave/unity/build/artifacts/generated/common/runtime/DebugBindings.gen.cpp Line: 51)

DynamicHeapAllocator allocation probe 1 failed - Could not get memory for large allocation 8294404.
DynamicHeapAllocator allocation probe 2 failed - Could not get memory for large allocation 8294404.
DynamicHeapAllocator allocation probe 3 failed - Could not get memory for large allocation 8294404.
DynamicHeapAllocator allocation probe 4 failed - Could not get memory for large allocation 8294404.
DynamicHeapAllocator out of memory - Could not get memory for large allocation 8294404!
Could not allocate memory: System out of memory!
Trying to allocate: 8294404B with 16 alignment. MemoryLabel: Texture
Allocation happend at: Line:475 in 
Memory overview

[ ALLOC_DEFAULT ] used: 315787554B | peak: 0B | reserved: 322896214B 
[ ALLOC_TEMP_JOB ] used: 0B | peak: 0B | reserved: 4194304B 
[ ALLOC_GFX ] used: 1306287232B | peak: 0B | reserved: 1320672064B 
[ ALLOC_CACHEOBJECTS ] used: 427168B | peak: 0B | reserved: 10485760B 
[ ALLOC_TYPETREE ] used: 0B | peak: 0B | reserved: 0B 
[ ALLOC_PROFILER ] used: 0B | peak: 0B | reserved: 0B 
[ ALLOC_TEMP_THREAD ] used: 32768B | peak: 0B | reserved: 3112960B 
Could not allocate memory: System out of memory!
Trying to allocate: 8294404B with 16 alignment. MemoryLabel: Texture
Allocation happend at: Line:475 in 
Memory overview

[ ALLOC_DEFAULT ] used: 315787554B | peak: 0B | reserved: 322896214B 
[ ALLOC_TEMP_JOB ] used: 0B | peak: 0B | reserved: 4194304B 
[ ALLOC_GFX ] used: 1306287232B | peak: 0B | reserved: 1320672064B 
[ ALLOC_CACHEOBJECTS ] used: 427168B | peak: 0B | reserved: 10485760B 
[ ALLOC_TYPETREE ] used: 0B | peak: 0B | reserved: 0B 
[ ALLOC_PROFILER ] used: 0B | peak: 0B | reserved: 0B 
[ ALLOC_TEMP_THREAD ] used: 32768B | peak: 0B | reserved: 3112960B 

 
(Filename:  Line: 1045)

Crash!!!
SymInit: Symbol-SearchPath: '.;C:\Steam\steamapps\common\Starward Rogue;C:\Steam\steamapps\common\Starward Rogue;C:\WINDOWS;C:\WINDOWS\system32;SRV*C:\websymbols*http://msdl.microsoft.com/download/symbols;', symOptions: 530, UserName: 'gmivb'
OS-Version: 10.0.17134 () 0x100-0x1
C:\Steam\steamapps\common\Starward Rogue\StarwardRogue.exe:StarwardRogue.exe (00C20000), size: 19247104 (result: 0), SymType: '-exported-', PDB: 'C:\Steam\steamapps\common\Starward Rogue\StarwardRogue.exe', fileVersion: 2017.1.0.11279
C:\WINDOWS\SYSTEM32\ntdll.dll:ntdll.dll (76EB0000), size: 1638400 (result: 0), SymType: '-exported-', PDB: 'C:\WINDOWS\SYSTEM32\ntdll.dll', fileVersion: 10.0.17134.1
C:\WINDOWS\System32\KERNEL32.DLL:KERNEL32.DLL (739E0000), size: 917504 (result: 0), SymType: '-exported-', PDB: 'C:\WINDOWS\System32\KERNEL32.DLL', fileVersion: 10.0.17134.1
C:\WINDOWS\System32\KERNELBASE.dll:KERNELBASE.dll (73CE0000), size: 1978368 (result: 0), SymType: '-exported-', PDB: 'C:\WINDOWS\System32\KERNELBASE.dll', fileVersion: 10.0.17134.1
C:\WINDOWS\System32\USER32.dll:USER32.dll (75850000), size: 1626112 (result: 0), SymType: '-exported-', PDB: 'C:\WINDOWS\System32\USER32.dll', fileVersion: 10.0.17134.1
C:\WINDOWS\System32\win32u.dll:win32u.dll (73920000), size: 94208 (result: 0), SymType: '-exported-', PDB: 'C:\WINDOWS\System32\win32u.dll', fileVersion: 10.0.17134.1
C:\WINDOWS\SYSTEM32\HID.DLL:HID.DLL (6AA60000), size: 40960 (result: 0), SymType: '-exported-', PDB: 'C:\WINDOWS\SYSTEM32\HID.DLL', fileVersion: 10.0.17134.1
C:\WINDOWS\System32\GDI32.dll:GDI32.dll (76D30000), size: 139264 (result: 0), SymType: '-exported-', PDB: 'C:\WINDOWS\System32\GDI32.dll', fileVersion: 10.0.17134.1
C:\WINDOWS\System32\msvcrt.dll:msvcrt.dll (74190000), size: 782336 (result: 0), SymType: '-exported-', PDB: 'C:\WINDOWS\System32\msvcrt.dll', fileVersion: 7.0.17134.1
C:\WINDOWS\System32\gdi32full.dll:gdi32full.dll (743B0000), size: 1458176 (result: 0), SymType: '-exported-', PDB: 'C:\WINDOWS\System32\gdi32full.dll', fileVersion: 10.0.17134.81
C:\WINDOWS\System32\msvcp_win.dll:msvcp_win.dll (73790000), size: 512000 (result: 0), SymType: '-exported-', PDB: 'C:\WINDOWS\System32\msvcp_win.dll', fileVersion: 10.0.17134.1
C:\WINDOWS\System32\ucrtbase.dll:ucrtbase.dll (75730000), size: 1171456 (result: 0), SymType: '-nosymbols-', PDB: 'C:\WINDOWS\System32\ucrtbase.dll', fileVersion: 10.0.17134.1
C:\WINDOWS\System32\ole32.dll:ole32.dll (74D40000), size: 1032192 (result: 0), SymType: '-exported-', PDB: 'C:\WINDOWS\System32\ole32.dll', fileVersion: 10.0.17134.1
C:\WINDOWS\System32\combase.dll:combase.dll (74520000), size: 2473984 (result: 0), SymType: '-exported-', PDB: 'C:\WINDOWS\System32\combase.dll', fileVersion: 10.0.17134.1
C:\WINDOWS\System32\RPCRT4.dll:RPCRT4.dll (75490000), size: 786432 (result: 0), SymType: '-nosymbols-', PDB: 'C:\WINDOWS\System32\RPCRT4.dll', fileVersion: 10.0.17134.48
C:\WINDOWS\SYSTEM32\VERSION.dll:VERSION.dll (73670000), size: 32768 (result: 0), SymType: '-exported-', PDB: 'C:\WINDOWS\SYSTEM32\VERSION.dll', fileVersion: 10.0.17134.1
C:\WINDOWS\System32\SspiCli.dll:SspiCli.dll (73770000), size: 131072 (result: 0), SymType: '-exported-', PDB: 'C:\WINDOWS\System32\SspiCli.dll', fileVersion: 10.0.17134.1
C:\WINDOWS\System32\CRYPTBASE.dll:CRYPTBASE.dll (73760000), size: 40960 (result: 0), SymType: '-exported-', PDB: 'C:\WINDOWS\System32\CRYPTBASE.dll', fileVersion: 10.0.17134.1
C:\WINDOWS\System32\bcryptPrimitives.dll:bcryptPrimitives.dll (73940000), size: 360448 (result: 0), SymType: '-exported-', PDB: 'C:\WINDOWS\System32\bcryptPrimitives.dll', fileVersion: 10.0.17134.1
C:\WINDOWS\System32\sechost.dll:sechost.dll (74260000), size: 278528 (result: 0), SymType: '-exported-', PDB: 'C:\WINDOWS\System32\sechost.dll', fileVersion: 10.0.17134.1
C:\WINDOWS\System32\SHLWAPI.dll:SHLWAPI.dll (75320000), size: 282624 (result: 0), SymType: '-nosymbols-', PDB: 'C:\WINDOWS\System32\SHLWAPI.dll', fileVersion: 10.0.17134.1
C:\WINDOWS\System32\SETUPAPI.dll:SETUPAPI.dll (74E40000), size: 4370432 (result: 0), SymType: '-nosymbols-', PDB: 'C:\WINDOWS\System32\SETUPAPI.dll', fileVersion: 10.0.17134.1
C:\WINDOWS\System32\cfgmgr32.dll:cfgmgr32.dll (739A0000), size: 233472 (result: 0), SymType: '-nosymbols-', PDB: 'C:\WINDOWS\System32\cfgmgr32.dll', fileVersion: 10.0.17134.1
C:\WINDOWS\System32\ADVAPI32.dll:ADVAPI32.dll (73840000), size: 491520 (result: 0), SymType: '-nosymbols-', PDB: 'C:\WINDOWS\System32\ADVAPI32.dll', fileVersion: 10.0.17134.1
C:\WINDOWS\System32\SHELL32.dll:SHELL32.dll (759E0000), size: 20226048 (result: 0), SymType: '-nosymbols-', PDB: 'C:\WINDOWS\System32\SHELL32.dll', fileVersion: 10.0.17134.81
C:\WINDOWS\System32\shcore.dll:shcore.dll (74320000), size: 561152 (result: 0), SymType: '-exported-', PDB: 'C:\WINDOWS\System32\shcore.dll', fileVersion: 10.0.17134.1
C:\WINDOWS\System32\windows.storage.dll:windows.storage.dll (74780000), size: 6004736 (result: 0), SymType: '-nosymbols-', PDB: 'C:\WINDOWS\System32\windows.storage.dll', fileVersion: 10.0.17134.81
C:\WINDOWS\System32\kernel.appcore.dll:kernel.appcore.dll (74310000), size: 61440 (result: 0), SymType: '-nosymbols-', PDB: 'C:\WINDOWS\System32\kernel.appcore.dll', fileVersion: 10.0.17134.1
C:\WINDOWS\System32\profapi.dll:profapi.dll (73820000), size: 98304 (result: 0), SymType: '-nosymbols-', PDB: 'C:\WINDOWS\System32\profapi.dll', fileVersion: 10.0.17134.1
C:\WINDOWS\System32\powrprof.dll:powrprof.dll (73AC0000), size: 282624 (result: 0), SymType: '-exported-', PDB: 'C:\WINDOWS\System32\powrprof.dll', fileVersion: 10.0.17134.1
C:\WINDOWS\System32\FLTLIB.DLL:FLTLIB.DLL (738C0000), size: 32768 (result: 0), SymType: '-exported-', PDB: 'C:\WINDOWS\System32\FLTLIB.DLL', fileVersion: 10.0.17134.1
C:\WINDOWS\System32\WS2_32.dll:WS2_32.dll (75550000), size: 421888 (result: 0), SymType: '-nosymbols-', PDB: 'C:\WINDOWS\System32\WS2_32.dll', fileVersion: 10.0.17134.1
C:\WINDOWS\System32\OLEAUT32.dll:OLEAUT32.dll (75270000), size: 614400 (result: 0), SymType: '-nosymbols-', PDB: 'C:\WINDOWS\System32\OLEAUT32.dll', fileVersion: 10.0.17134.48
C:\WINDOWS\SYSTEM32\OPENGL32.dll:OPENGL32.dll (67EF0000), size: 888832 (result: 0), SymType: '-nosymbols-', PDB: 'C:\WINDOWS\SYSTEM32\OPENGL32.dll', fileVersion: 10.0.17134.1
C:\WINDOWS\System32\IMM32.dll:IMM32.dll (74070000), size: 155648 (result: 0), SymType: '-nosymbols-', PDB: 'C:\WINDOWS\System32\IMM32.dll', fileVersion: 10.0.17134.1
C:\WINDOWS\SYSTEM32\WINMM.dll:WINMM.dll (6E1B0000), size: 147456 (result: 0), SymType: '-nosymbols-', PDB: 'C:\WINDOWS\SYSTEM32\WINMM.dll', fileVersion: 10.0.17134.1
C:\WINDOWS\SYSTEM32\GLU32.dll:GLU32.dll (67270000), size: 258048 (result: 0), SymType: '-nosymbols-', PDB: 'C:\WINDOWS\SYSTEM32\GLU32.dll', fileVersion: 10.0.17134.1
C:\WINDOWS\SYSTEM32\DNSAPI.dll:DNSAPI.dll (6FF10000), size: 581632 (result: 0), SymType: '-nosymbols-', PDB: 'C:\WINDOWS\SYSTEM32\DNSAPI.dll', fileVersion: 10.0.17134.1
C:\WINDOWS\SYSTEM32\IPHLPAPI.DLL:IPHLPAPI.DLL (6FFA0000), size: 196608 (result: 0), SymType: '-nosymbols-', PDB: 'C:\WINDOWS\SYSTEM32\IPHLPAPI.DLL', fileVersion: 10.0.17134.1
C:\WINDOWS\SYSTEM32\WINHTTP.dll:WINHTTP.dll (6E930000), size: 720896 (result: 0), SymType: '-nosymbols-', PDB: 'C:\WINDOWS\SYSTEM32\WINHTTP.dll', fileVersion: 10.0.17134.1
C:\WINDOWS\System32\NSI.dll:NSI.dll (74250000), size: 28672 (result: 0), SymType: '-nosymbols-', PDB: 'C:\WINDOWS\System32\NSI.dll', fileVersion: 10.0.17134.1
C:\WINDOWS\SYSTEM32\WINMMBASE.dll:WINMMBASE.dll (6D350000), size: 143360 (result: 0), SymType: '-nosymbols-', PDB: 'C:\WINDOWS\SYSTEM32\WINMMBASE.dll', fileVersion: 10.0.17134.1
C:\Steam\gameoverlayrenderer.dll:gameoverlayrenderer.dll (6D040000), size: 1327104 (result: 0), SymType: '-nosymbols-', PDB: 'C:\Steam\gameoverlayrenderer.dll', fileVersion: 4.54.16.53
C:\WINDOWS\System32\PSAPI.DLL:PSAPI.DLL (75310000), size: 24576 (result: 0), SymType: '-nosymbols-', PDB: 'C:\WINDOWS\System32\PSAPI.DLL', fileVersion: 10.0.17134.1
C:\WINDOWS\system32\uxtheme.dll:uxtheme.dll (6D530000), size: 507904 (result: 0), SymType: '-nosymbols-', PDB: 'C:\WINDOWS\system32\uxtheme.dll', fileVersion: 10.0.17134.1
C:\Steam\steamapps\common\Starward Rogue\StarwardRogue_Data\Mono\EmbedRuntime\mono.dll:mono.dll (10000000), size: 2289664 (result: 0), SymType: '-nosymbols-', PDB: 'C:\Steam\steamapps\common\Starward Rogue\StarwardRogue_Data\Mono\EmbedRuntime\mono.dll', fileVersion: 1.0.0.1
C:\WINDOWS\SYSTEM32\MSWSOCK.dll:MSWSOCK.dll (6FE60000), size: 352256 (result: 0), SymType: '-nosymbols-', PDB: 'C:\WINDOWS\SYSTEM32\MSWSOCK.dll', fileVersion: 10.0.17134.1
C:\WINDOWS\System32\MSCTF.dll:MSCTF.dll (73B70000), size: 1327104 (result: 0), SymType: '-nosymbols-', PDB: 'C:\WINDOWS\System32\MSCTF.dll', fileVersion: 10.0.17134.1
C:\WINDOWS\system32\dwmapi.dll:dwmapi.dll (6D500000), size: 143360 (result: 0), SymType: '-nosymbols-', PDB: 'C:\WINDOWS\system32\dwmapi.dll', fileVersion: 10.0.17134.1
C:\WINDOWS\SYSTEM32\d3d9.dll:d3d9.dll (61700000), size: 1503232 (result: 0), SymType: '-nosymbols-', PDB: 'C:\WINDOWS\SYSTEM32\d3d9.dll', fileVersion: 10.0.17134.81
C:\WINDOWS\System32\DriverStore\FileRepository\igdlh64.inf_amd64_bc75cebf5edbbc50\igdumdim32.dll:igdumdim32.dll (6CE90000), size: 1716224 (result: 0), SymType: '-nosymbols-', PDB: 'C:\WINDOWS\System32\DriverStore\FileRepository\igdlh64.inf_amd64_bc75cebf5edbbc50\igdumdim32.dll', fileVersion: 23.20.16.4973
C:\WINDOWS\System32\DriverStore\FileRepository\igdlh64.inf_amd64_bc75cebf5edbbc50\igd9dxva32.dll:igd9dxva32.dll (5B770000), size: 48836608 (result: 0), SymType: '-nosymbols-', PDB: 'C:\WINDOWS\System32\DriverStore\FileRepository\igdlh64.inf_amd64_bc75cebf5edbbc50\igd9dxva32.dll', fileVersion: 23.20.16.4973
C:\WINDOWS\System32\DriverStore\FileRepository\igdlh64.inf_amd64_bc75cebf5edbbc50\igc32.dll:igc32.dll (59D70000), size: 27205632 (result: 0), SymType: '-nosymbols-', PDB: 'C:\WINDOWS\System32\DriverStore\FileRepository\igdlh64.inf_amd64_bc75cebf5edbbc50\igc32.dll', fileVersion: 23.20.16.4973
C:\WINDOWS\System32\clbcatq.dll:clbcatq.dll (75370000), size: 536576 (result: 0), SymType: '-nosymbols-', PDB: 'C:\WINDOWS\System32\clbcatq.dll', fileVersion: 2001.12.10941.16384
C:\WINDOWS\System32\MMDevApi.dll:MMDevApi.dll (6D2E0000), size: 376832 (result: 0), SymType: '-nosymbols-', PDB: 'C:\WINDOWS\System32\MMDevApi.dll', fileVersion: 10.0.17134.1
C:\WINDOWS\System32\PROPSYS.dll:PROPSYS.dll (6F750000), size: 1572864 (result: 0), SymType: '-nosymbols-', PDB: 'C:\WINDOWS\System32\PROPSYS.dll', fileVersion: 7.0.17134.1
C:\WINDOWS\System32\DEVOBJ.dll:DEVOBJ.dll (6FE30000), size: 139264 (result: 0), SymType: '-nosymbols-', PDB: 'C:\WINDOWS\System32\DEVOBJ.dll', fileVersion: 10.0.17134.1
C:\WINDOWS\SYSTEM32\wdmaud.drv:wdmaud.drv (6D2A0000), size: 241664 (result: 0), SymType: '-nosymbols-', PDB: 'C:\WINDOWS\SYSTEM32\wdmaud.drv', fileVersion: 10.0.17134.1
C:\WINDOWS\SYSTEM32\ksuser.dll:ksuser.dll (6D290000), size: 28672 (result: 0), SymType: '-nosymbols-', PDB: 'C:\WINDOWS\SYSTEM32\ksuser.dll', fileVersion: 10.0.17134.1
C:\WINDOWS\SYSTEM32\AVRT.dll:AVRT.dll (6D280000), size: 32768 (result: 0), SymType: '-nosymbols-', PDB: 'C:\WINDOWS\SYSTEM32\AVRT.dll', fileVersion: 10.0.17134.1
C:\WINDOWS\SYSTEM32\AUDIOSES.DLL:AUDIOSES.DLL (6BE20000), size: 1028096 (result: 0), SymType: '-nosymbols-', PDB: 'C:\WINDOWS\SYSTEM32\AUDIOSES.DLL', fileVersion: 10.0.17134.81
C:\WINDOWS\SYSTEM32\wintypes.dll:wintypes.dll (6F0B0000), size: 876544 (result: 0), SymType: '-nosymbols-', PDB: 'C:\WINDOWS\SYSTEM32\wintypes.dll', fileVersion: 10.0.17134.1
C:\WINDOWS\SYSTEM32\msacm32.drv:msacm32.drv (6D270000), size: 40960 (result: 0), SymType: '-nosymbols-', PDB: 'C:\WINDOWS\SYSTEM32\msacm32.drv', fileVersion: 10.0.17134.1
C:\WINDOWS\SYSTEM32\MSACM32.dll:MSACM32.dll (6E170000), size: 102400 (result: 0), SymType: '-nosymbols-', PDB: 'C:\WINDOWS\SYSTEM32\MSACM32.dll', fileVersion: 10.0.17134.1
C:\WINDOWS\SYSTEM32\midimap.dll:midimap.dll (6D260000), size: 32768 (result: 0), SymType: '-nosymbols-', PDB: 'C:\WINDOWS\SYSTEM32\midimap.dll', fileVersion: 10.0.17134.1
C:\WINDOWS\SYSTEM32\xinput1_3.dll:xinput1_3.dll (00400000), size: 90112 (result: 0), SymType: '-nosymbols-', PDB: 'C:\WINDOWS\SYSTEM32\xinput1_3.dll', fileVersion: 9.18.944.0
C:\WINDOWS\SYSTEM32\TextInputFramework.dll:TextInputFramework.dll (6B8B0000), size: 516096 (result: 0), SymType: '-nosymbols-', PDB: 'C:\WINDOWS\SYSTEM32\TextInputFramework.dll', fileVersion: 10.0.17134.1
C:\WINDOWS\SYSTEM32\CoreUIComponents.dll:CoreUIComponents.dll (6B650000), size: 2478080 (result: 0), SymType: '-nosymbols-', PDB: 'C:\WINDOWS\SYSTEM32\CoreUIComponents.dll', fileVersion: 10.0.17134.81
C:\WINDOWS\SYSTEM32\CoreMessaging.dll:CoreMessaging.dll (6B5C0000), size: 569344 (result: 0), SymType: '-nosymbols-', PDB: 'C:\WINDOWS\SYSTEM32\CoreMessaging.dll', fileVersion: 10.0.17134.81
C:\WINDOWS\SYSTEM32\ntmarta.dll:ntmarta.dll (6EE00000), size: 167936 (result: 0), SymType: '-nosymbols-', PDB: 'C:\WINDOWS\SYSTEM32\ntmarta.dll', fileVersion: 10.0.17134.1
C:\WINDOWS\system32\wbem\wbemprox.dll:wbemprox.dll (6E810000), size: 53248 (result: 0), SymType: '-nosymbols-', PDB: 'C:\WINDOWS\system32\wbem\wbemprox.dll', fileVersion: 10.0.17134.1
C:\WINDOWS\SYSTEM32\wbemcomn.dll:wbemcomn.dll (6E820000), size: 438272 (result: 0), SymType: '-nosymbols-', PDB: 'C:\WINDOWS\SYSTEM32\wbemcomn.dll', fileVersion: 10.0.17134.1
C:\WINDOWS\SYSTEM32\bcrypt.dll:bcrypt.dll (70020000), size: 102400 (result: 0), SymType: '-nosymbols-', PDB: 'C:\WINDOWS\SYSTEM32\bcrypt.dll', fileVersion: 10.0.17134.1
C:\WINDOWS\system32\wbem\wbemsvc.dll:wbemsvc.dll (6E800000), size: 65536 (result: 0), SymType: '-nosymbols-', PDB: 'C:\WINDOWS\system32\wbem\wbemsvc.dll', fileVersion: 10.0.17134.1
C:\WINDOWS\system32\wbem\fastprox.dll:fastprox.dll (6E3A0000), size: 798720 (result: 0), SymType: '-nosymbols-', PDB: 'C:\WINDOWS\system32\wbem\fastprox.dll', fileVersion: 10.0.17134.1
C:\WINDOWS\SYSTEM32\CRYPTSP.dll:CRYPTSP.dll (70000000), size: 77824 (result: 0), SymType: '-nosymbols-', PDB: 'C:\WINDOWS\SYSTEM32\CRYPTSP.dll', fileVersion: 10.0.17134.1
C:\WINDOWS\system32\rsaenh.dll:rsaenh.dll (6FFD0000), size: 192512 (result: 0), SymType: '-nosymbols-', PDB: 'C:\WINDOWS\system32\rsaenh.dll', fileVersion: 10.0.17134.1
C:\WINDOWS\SYSTEM32\dhcpcsvc6.DLL:dhcpcsvc6.DLL (6FEF0000), size: 77824 (result: 0), SymType: '-nosymbols-', PDB: 'C:\WINDOWS\SYSTEM32\dhcpcsvc6.DLL', fileVersion: 10.0.17134.1
C:\WINDOWS\SYSTEM32\dhcpcsvc.DLL:dhcpcsvc.DLL (6FED0000), size: 81920 (result: 0), SymType: '-nosymbols-', PDB: 'C:\WINDOWS\SYSTEM32\dhcpcsvc.DLL', fileVersion: 10.0.17134.1
C:\Windows\System32\rasadhlp.dll:rasadhlp.dll (6EF30000), size: 32768 (result: 0), SymType: '-nosymbols-', PDB: 'C:\Windows\System32\rasadhlp.dll', fileVersion: 10.0.17134.1
C:\WINDOWS\System32\fwpuclnt.dll:fwpuclnt.dll (6EEE0000), size: 323584 (result: 0), SymType: '-nosymbols-', PDB: 'C:\WINDOWS\System32\fwpuclnt.dll', fileVersion: 10.0.17134.1
C:\Steam\steamapps\common\Starward Rogue\StarwardRogue_Data\Plugins\XInputInterface32.dll:XInputInterface32.dll (6E260000), size: 77824 (result: 0), SymType: '-nosymbols-', PDB: 'C:\Steam\steamapps\common\Starward Rogue\StarwardRogue_Data\Plugins\XInputInterface32.dll'
C:\WINDOWS\System32\WINTRUST.dll:WINTRUST.dll (738D0000), size: 290816 (result: 0), SymType: '-nosymbols-', PDB: 'C:\WINDOWS\System32\WINTRUST.dll', fileVersion: 10.0.17134.81
C:\WINDOWS\System32\MSASN1.dll:MSASN1.dll (74180000), size: 57344 (result: 0), SymType: '-nosymbols-', PDB: 'C:\WINDOWS\System32\MSASN1.dll', fileVersion: 10.0.17134.1
C:\WINDOWS\System32\CRYPT32.dll:CRYPT32.dll (233F0000), size: 1662976 (result: 0), SymType: '-nosymbols-', PDB: 'C:\WINDOWS\System32\CRYPT32.dll', fileVersion: 10.0.17134.1
C:\Steam\steamapps\common\Starward Rogue\StarwardRogue_Data\Plugins\CSteamworks.dll:CSteamworks.dll (6E230000), size: 135168 (result: 0), SymType: '-nosymbols-', PDB: 'C:\Steam\steamapps\common\Starward Rogue\StarwardRogue_Data\Plugins\CSteamworks.dll', fileVersion: 1.7.0.0
C:\Steam\steamapps\common\Starward Rogue\steam_api.dll:steam_api.dll (6E210000), size: 122880 (result: 0), SymType: '-nosymbols-', PDB: 'C:\Steam\steamapps\common\Starward Rogue\steam_api.dll', fileVersion: 2.19.34.93
C:\Steam\steamclient.dll:steamclient.dll (5F2D0000), size: 12296192 (result: 0), SymType: '-nosymbols-', PDB: 'C:\Steam\steamclient.dll', fileVersion: 4.54.16.53
C:\WINDOWS\System32\imagehlp.dll:imagehlp.dll (73CC0000), size: 102400 (result: 0), SymType: '-nosymbols-', PDB: 'C:\WINDOWS\System32\imagehlp.dll', fileVersion: 10.0.17134.1
C:\Steam\vstdlib_s.dll:vstdlib_s.dll (6AA70000), size: 380928 (result: 0), SymType: '-nosymbols-', PDB: 'C:\Steam\vstdlib_s.dll', fileVersion: 4.54.16.53
C:\Steam\tier0_s.dll:tier0_s.dll (68860000), size: 626688 (result: 0), SymType: '-nosymbols-', PDB: 'C:\Steam\tier0_s.dll', fileVersion: 4.54.16.53
C:\WINDOWS\SYSTEM32\Secur32.dll:Secur32.dll (6EED0000), size: 40960 (result: 0), SymType: '-nosymbols-', PDB: 'C:\WINDOWS\SYSTEM32\Secur32.dll', fileVersion: 10.0.17134.1
C:\Steam\steam.dll:steam.dll (6CDC0000), size: 794624 (result: 0), SymType: '-nosymbols-', PDB: 'C:\Steam\steam.dll'
C:\Steam\Steam2.dll:Steam2.dll (6C7C0000), size: 2887680 (result: 0), SymType: '-nosymbols-', PDB: 'C:\Steam\Steam2.dll', fileVersion: 2.0.2117.156
C:\WINDOWS\system32\napinsp.dll:napinsp.dll (6D8D0000), size: 69632 (result: 0), SymType: '-nosymbols-', PDB: 'C:\WINDOWS\system32\napinsp.dll', fileVersion: 10.0.17134.1
C:\WINDOWS\system32\pnrpnsp.dll:pnrpnsp.dll (6D8B0000), size: 90112 (result: 0), SymType: '-nosymbols-', PDB: 'C:\WINDOWS\system32\pnrpnsp.dll', fileVersion: 10.0.17134.1
C:\WINDOWS\system32\NLAapi.dll:NLAapi.dll (6D890000), size: 77824 (result: 0), SymType: '-nosymbols-', PDB: 'C:\WINDOWS\system32\NLAapi.dll', fileVersion: 10.0.17134.1
C:\WINDOWS\System32\winrnr.dll:winrnr.dll (6D880000), size: 49152 (result: 0), SymType: '-nosymbols-', PDB: 'C:\WINDOWS\System32\winrnr.dll', fileVersion: 10.0.17134.1
C:\Steam\DbgHelp.dll:DbgHelp.dll (6CCA0000), size: 1134592 (result: 0), SymType: '-nosymbols-', PDB: 'C:\Steam\DbgHelp.dll', fileVersion: 6.7.5.0
C:\Steam\CSERHelper.dll:CSERHelper.dll (6E1E0000), size: 135168 (result: 0), SymType: '-nosymbols-', PDB: 'C:\Steam\CSERHelper.dll', fileVersion: 4.50.0.0
C:\Windows\System32\Windows.UI.dll:Windows.UI.dll (6AB30000), size: 888832 (result: 0), SymType: '-nosymbols-', PDB: 'C:\Windows\System32\Windows.UI.dll', fileVersion: 10.0.17134.1
C:\Windows\System32\InputHost.dll:InputHost.dll (6AAD0000), size: 368640 (result: 0), SymType: '-nosymbols-', PDB: 'C:\Windows\System32\InputHost.dll'

========== OUTPUTING STACK TRACE ==================

  ERROR: SymGetSymFromAddr64, GetLastError: 'Попытка обращения к неверному адресу.' (Address: 01A6CD95)
0x01A6CD95 (StarwardRogue) 
  ERROR: SymGetSymFromAddr64, GetLastError: 'Попытка обращения к неверному адресу.' (Address: 014FCD10)
0x014FCD10 (StarwardRogue) 
  ERROR: SymGetSymFromAddr64, GetLastError: 'Попытка обращения к неверному адресу.' (Address: 014F62C2)
0x014F62C2 (StarwardRogue) 
  ERROR: SymGetSymFromAddr64, GetLastError: 'Попытка обращения к неверному адресу.' (Address: 014F6359)
0x014F6359 (StarwardRogue) 
  ERROR: SymGetSymFromAddr64, GetLastError: 'Попытка обращения к неверному адресу.' (Address: 00C82AE6)
0x00C82AE6 (StarwardRogue) 
  ERROR: SymGetSymFromAddr64, GetLastError: 'Попытка обращения к неверному адресу.' (Address: 00C83D89)
0x00C83D89 (StarwardRogue) 
  ERROR: SymGetSymFromAddr64, GetLastError: 'Попытка обращения к неверному адресу.' (Address: 00C840B5)
0x00C840B5 (StarwardRogue) 
  ERROR: SymGetSymFromAddr64, GetLastError: 'Попытка обращения к неверному адресу.' (Address: 00C843BC)
0x00C843BC (StarwardRogue) 
  ERROR: SymGetSymFromAddr64, GetLastError: 'Попытка обращения к неверному адресу.' (Address: 014AED43)
0x014AED43 (StarwardRogue) 
0x06D9AC30 (Mono JIT Code) (wrapper managed-to-native) UnityEngine.ImageConversion:LoadImage (UnityEngine.Texture2D,byte[],bool)
0x06D9ABEE (Mono JIT Code) UnityEngine.ImageConversion:LoadImage (UnityEngine.Texture2D,byte[])
0x28DC9764 (Mono JIT Code) GameImage:FinishLoadTextureFromFileAsync ()
0x06DD27AC (Mono JIT Code) GameImage:CheckLoad ()
0x06DD160C (Mono JIT Code) Game:UpdateStreaming ()
0x06D71923 (Mono JIT Code) ArcenMainCameraImplementations:MainUpdateLogic ()
0x06D71023 (Mono JIT Code) MainCameraLogic:Update ()
0x06CFF041 (Mono JIT Code) (wrapper runtime-invoke) object:runtime_invoke_void__this__ (object,intptr,intptr,intptr)
  ERROR: SymGetSymFromAddr64, GetLastError: 'Попытка обращения к неверному адресу.' (Address: 100F1AE7)
0x100F1AE7 (mono) 
  ERROR: SymGetSymFromAddr64, GetLastError: 'Попытка обращения к неверному адресу.' (Address: 1005DAC3)
0x1005DAC3 (mono) 
  ERROR: SymGetSymFromAddr64, GetLastError: 'Попытка обращения к неверному адресу.' (Address: 01213FB0)
0x01213FB0 (StarwardRogue) 
  ERROR: SymGetSymFromAddr64, GetLastError: 'Попытка обращения к неверному адресу.' (Address: 01210792)
0x01210792 (StarwardRogue) 
  ERROR: SymGetSymFromAddr64, GetLastError: 'Попытка обращения к неверному адресу.' (Address: 010CB75E)
0x010CB75E (StarwardRogue) 
  ERROR: SymGetSymFromAddr64, GetLastError: 'Попытка обращения к неверному адресу.' (Address: 010D3191)
0x010D3191 (StarwardRogue) 
  ERROR: SymGetSymFromAddr64, GetLastError: 'Попытка обращения к неверному адресу.' (Address: 010D31A7)
0x010D31A7 (StarwardRogue) 
  ERROR: SymGetSymFromAddr64, GetLastError: 'Попытка обращения к неверному адресу.' (Address: 010AEE2C)
0x010AEE2C (StarwardRogue) 
  ERROR: SymGetSymFromAddr64, GetLastError: 'Попытка обращения к неверному адресу.' (Address: 00CCDA1E)
0x00CCDA1E (StarwardRogue) 
  ERROR: SymGetSymFromAddr64, GetLastError: 'Попытка обращения к неверному адресу.' (Address: 014DF3A8)
0x014DF3A8 (StarwardRogue) 
  ERROR: SymGetSymFromAddr64, GetLastError: 'Попытка обращения к неверному адресу.' (Address: 01A6241D)
0x01A6241D (StarwardRogue) 
0x739F8484 (KERNEL32) BaseThreadInitThunk
0x76F12EC0 (ntdll) RtlValidSecurityDescriptor
0x76F12E90 (ntdll) RtlValidSecurityDescriptor

========== END OF STACKTRACE ===========

**** Crash! ****
output_log.txt (43,980 bytes)

logorouge

Jun 5, 2018 1:47 pm

reporter   ~0047555

How high does the memory usage of the game go for you during a long run?

patsancheg

Jun 5, 2018 1:57 pm

reporter   ~0047556

according to error.log it's "47% memory in use."
I have 8Gb of RAM, however 32bit application can only utilize 1.7Gb, as far as I know.

logorouge

Jun 5, 2018 2:09 pm

reporter   ~0047557

If you can, try to check with the task manager how high it is at the start of a run and again on later floors.

patsancheg

Jun 5, 2018 4:21 pm

reporter   ~0047558

I started a new run.
Floor 1: 2508Mb
Floor 3: 1490Mb
Floor 5 cleared: 619Mb
Floor 6 cleared 961Mb
Crash at the beginning of floor 7.
No crash report this time.
But all the previous crashes generate this line in the output_log.txt
"Could not allocate memory: System out of memory!"
error.log and output_log.txt from another crash that happened today

error-2.log (50,770 bytes)
output_log-2.txt (43,973 bytes)
Initialize engine version: 2017.1.0p4 (892c0f8d8f8a)
GfxDevice: creating device client; threaded=1
Direct3D:
    Version:  Direct3D 9.0c [igdumdim32.dll 23.20.16.4973]
    Renderer: Intel(R) HD Graphics 630
    Vendor:   Intel
    VRAM:     2111 MB (via DXGI)
    Caps:     Shader=30 DepthRT=1 NativeDepth=1 NativeShadow=1 DF16=1 INTZ=1 NULL=1 RESZ=1 SlowINTZ=0 ATOC=1 BC4=1 BC5=1
Begin MonoManager ReloadAssembly
Platform assembly: C:\Steam\steamapps\common\Starward Rogue\StarwardRogue_Data\Managed\UnityEngine.dll (this message is harmless)
Loading C:\Steam\steamapps\common\Starward Rogue\StarwardRogue_Data\Managed\UnityEngine.dll into Unity Child Domain
Platform assembly: C:\Steam\steamapps\common\Starward Rogue\StarwardRogue_Data\Managed\I18N.dll (this message is harmless)
Platform assembly: C:\Steam\steamapps\common\Starward Rogue\StarwardRogue_Data\Managed\I18N.Other.dll (this message is harmless)
Platform assembly: C:\Steam\steamapps\common\Starward Rogue\StarwardRogue_Data\Managed\Assembly-CSharp.dll (this message is harmless)
Loading C:\Steam\steamapps\common\Starward Rogue\StarwardRogue_Data\Managed\Assembly-CSharp.dll into Unity Child Domain
Platform assembly: C:\Steam\steamapps\common\Starward Rogue\StarwardRogue_Data\Managed\UnityEngine.UI.dll (this message is harmless)
Loading C:\Steam\steamapps\common\Starward Rogue\StarwardRogue_Data\Managed\UnityEngine.UI.dll into Unity Child Domain
Platform assembly: C:\Steam\steamapps\common\Starward Rogue\StarwardRogue_Data\Managed\UnityEngine.Networking.dll (this message is harmless)
Loading C:\Steam\steamapps\common\Starward Rogue\StarwardRogue_Data\Managed\UnityEngine.Networking.dll into Unity Child Domain
Platform assembly: C:\Steam\steamapps\common\Starward Rogue\StarwardRogue_Data\Managed\UnityEngine.Timeline.dll (this message is harmless)
Loading C:\Steam\steamapps\common\Starward Rogue\StarwardRogue_Data\Managed\UnityEngine.Timeline.dll into Unity Child Domain
Platform assembly: C:\Steam\steamapps\common\Starward Rogue\StarwardRogue_Data\Managed\Ionic.Zip.Reduced.dll (this message is harmless)
Loading C:\Steam\steamapps\common\Starward Rogue\StarwardRogue_Data\Managed\Ionic.Zip.Reduced.dll into Unity Child Domain
Platform assembly: C:\Steam\steamapps\common\Starward Rogue\StarwardRogue_Data\Managed\ExcelLibrary.dll (this message is harmless)
Loading C:\Steam\steamapps\common\Starward Rogue\StarwardRogue_Data\Managed\ExcelLibrary.dll into Unity Child Domain
Platform assembly: C:\Steam\steamapps\common\Starward Rogue\StarwardRogue_Data\Managed\I18N.CJK.dll (this message is harmless)
Loading C:\Steam\steamapps\common\Starward Rogue\StarwardRogue_Data\Managed\I18N.CJK.dll into Unity Child Domain
Platform assembly: C:\Steam\steamapps\common\Starward Rogue\StarwardRogue_Data\Managed\I18N.dll (this message is harmless)
Loading C:\Steam\steamapps\common\Starward Rogue\StarwardRogue_Data\Managed\I18N.dll into Unity Child Domain
Platform assembly: C:\Steam\steamapps\common\Starward Rogue\StarwardRogue_Data\Managed\I18N.MidEast.dll (this message is harmless)
Loading C:\Steam\steamapps\common\Starward Rogue\StarwardRogue_Data\Managed\I18N.MidEast.dll into Unity Child Domain
Platform assembly: C:\Steam\steamapps\common\Starward Rogue\StarwardRogue_Data\Managed\I18N.Other.dll (this message is harmless)
Loading C:\Steam\steamapps\common\Starward Rogue\StarwardRogue_Data\Managed\I18N.Other.dll into Unity Child Domain
Platform assembly: C:\Steam\steamapps\common\Starward Rogue\StarwardRogue_Data\Managed\I18N.Rare.dll (this message is harmless)
Loading C:\Steam\steamapps\common\Starward Rogue\StarwardRogue_Data\Managed\I18N.Rare.dll into Unity Child Domain
Platform assembly: C:\Steam\steamapps\common\Starward Rogue\StarwardRogue_Data\Managed\I18N.West.dll (this message is harmless)
Loading C:\Steam\steamapps\common\Starward Rogue\StarwardRogue_Data\Managed\I18N.West.dll into Unity Child Domain
Platform assembly: C:\Steam\steamapps\common\Starward Rogue\StarwardRogue_Data\Managed\System.Drawing.dll (this message is harmless)
Loading C:\Steam\steamapps\common\Starward Rogue\StarwardRogue_Data\Managed\System.Drawing.dll into Unity Child Domain
Platform assembly: C:\Steam\steamapps\common\Starward Rogue\StarwardRogue_Data\Managed\Steamworks.NET.dll (this message is harmless)
Loading C:\Steam\steamapps\common\Starward Rogue\StarwardRogue_Data\Managed\Steamworks.NET.dll into Unity Child Domain
Platform assembly: C:\Steam\steamapps\common\Starward Rogue\StarwardRogue_Data\Managed\Steamworks.NET.dll (this message is harmless)
Loading C:\Steam\steamapps\common\Starward Rogue\StarwardRogue_Data\Managed\Steamworks.NET.dll into Unity Child Domain
Platform assembly: C:\Steam\steamapps\common\Starward Rogue\StarwardRogue_Data\Managed\System.dll (this message is harmless)
Platform assembly: C:\Steam\steamapps\common\Starward Rogue\StarwardRogue_Data\Managed\System.Core.dll (this message is harmless)
- Completed reload, in  0.088 seconds
WARNING: Shader Unsupported: 'Hidden/VR/BlitCopyFromTexArray' - Pass '' has no vertex shader
WARNING: Shader Unsupported: 'Hidden/VR/BlitCopyFromTexArray' - Setting to default shader.
<RI> Initializing input.

<RI> Input initialized.

<RI> Initialized touch support.

UnloadTime: 1.436160 ms
Fallback handler could not load library C:/Steam/steamapps/common/Starward Rogue/StarwardRogue_Data/Mono/XInputInterface64
Fallback handler could not load library C:/Steam/steamapps/common/Starward Rogue/StarwardRogue_Data/Mono/.\XInputInterface64
Fallback handler could not load library C:/Steam/steamapps/common/Starward Rogue/StarwardRogue_Data/Mono/XInputInterface64
Fallback handler could not load library C:/Steam/steamapps/common/Starward Rogue/StarwardRogue_Data/Mono/libXInputInterface64
Fallback handler could not load library C:/Steam/steamapps/common/Starward Rogue/StarwardRogue_Data/Mono/.\libXInputInterface64
Fallback handler could not load library C:/Steam/steamapps/common/Starward Rogue/StarwardRogue_Data/Mono/libXInputInterface64
Steamworks Init
 
(Filename: C:/buildslave/unity/build/artifacts/generated/common/runtime/DebugBindings.gen.cpp Line: 51)

Steamworks IsRunning: True
 
(Filename: C:/buildslave/unity/build/artifacts/generated/common/runtime/DebugBindings.gen.cpp Line: 51)

graphicsShaderLevel:30
graphicsDeviceID:22802
graphicsDeviceName:Intel(R) HD Graphics 630
graphicsDeviceVendor:Intel
graphicsDeviceVendorID:32902
graphicsDeviceVersion:Direct3D 9.0c [igdumdim32.dll 23.20.16.4973]
graphicsMemorySize:2111
graphicsMultiThreaded:True
operatingSystem:Windows 10  (10.0.0) 64bit
processorCount:4
processorType:Intel(R) Core(TM) i5-7400T CPU @ 2.40GHz
processorFrequency:2400 mHz
supportsImageEffects:True
supportsShadows:True
maxTextureSize:8192
npotSupport:Full
systemMemorySize:8084
 
(Filename: C:/buildslave/unity/build/artifacts/generated/common/runtime/DebugBindings.gen.cpp Line: 51)

Platform assembly: C:\Steam\steamapps\common\Starward Rogue\StarwardRogue_Data\Managed\System.Xml.dll (this message is harmless)
Steamworks Init
 
(Filename: C:/buildslave/unity/build/artifacts/generated/common/runtime/DebugBindings.gen.cpp Line: 51)

Steamworks IsRunning: True
 
(Filename: C:/buildslave/unity/build/artifacts/generated/common/runtime/DebugBindings.gen.cpp Line: 51)

GameInit (0 - 6/5/2018 2:02:37 PM)
 
(Filename: C:/buildslave/unity/build/artifacts/generated/common/runtime/DebugBindings.gen.cpp Line: 51)

Expansion 1 music installed.
 
(Filename: C:/buildslave/unity/build/artifacts/generated/common/runtime/DebugBindings.gen.cpp Line: 51)

PerfectClearBoss_CrystalMother:Installed
 
(Filename: C:/buildslave/unity/build/artifacts/generated/common/runtime/DebugBindings.gen.cpp Line: 51)

PerfectClearBoss_Battleswarm:Installed
 
(Filename: C:/buildslave/unity/build/artifacts/generated/common/runtime/DebugBindings.gen.cpp Line: 51)

PerfectClearBoss_WallMaster:Installed
 
(Filename: C:/buildslave/unity/build/artifacts/generated/common/runtime/DebugBindings.gen.cpp Line: 51)

PerfectClearBoss_Mirror:Installed
 
(Filename: C:/buildslave/unity/build/artifacts/generated/common/runtime/DebugBindings.gen.cpp Line: 51)

PerfectClearBoss_Backfire:Installed
 
(Filename: C:/buildslave/unity/build/artifacts/generated/common/runtime/DebugBindings.gen.cpp Line: 51)

PerfectClearBoss_ShrapnelRose:Installed
 
(Filename: C:/buildslave/unity/build/artifacts/generated/common/runtime/DebugBindings.gen.cpp Line: 51)

PerfectClearBoss_LadyStaccato:Installed
 
(Filename: C:/buildslave/unity/build/artifacts/generated/common/runtime/DebugBindings.gen.cpp Line: 51)

PerfectClearBoss_Labyrinth:Installed
 
(Filename: C:/buildslave/unity/build/artifacts/generated/common/runtime/DebugBindings.gen.cpp Line: 51)

PerfectClearBoss_Aggressor:Installed
 
(Filename: C:/buildslave/unity/build/artifacts/generated/common/runtime/DebugBindings.gen.cpp Line: 51)

PerfectClearBoss_Centrifuge:Installed
 
(Filename: C:/buildslave/unity/build/artifacts/generated/common/runtime/DebugBindings.gen.cpp Line: 51)

PerfectClearBoss_Vestige:Installed
 
(Filename: C:/buildslave/unity/build/artifacts/generated/common/runtime/DebugBindings.gen.cpp Line: 51)

PerfectClearBoss_Fusillade:Installed
 
(Filename: C:/buildslave/unity/build/artifacts/generated/common/runtime/DebugBindings.gen.cpp Line: 51)

PerfectClearBoss_Aberration:Installed
 
(Filename: C:/buildslave/unity/build/artifacts/generated/common/runtime/DebugBindings.gen.cpp Line: 51)

PerfectClearBoss_TheWarden:Installed
 
(Filename: C:/buildslave/unity/build/artifacts/generated/common/runtime/DebugBindings.gen.cpp Line: 51)

PerfectClearBoss_Terminus:Installed
 
(Filename: C:/buildslave/unity/build/artifacts/generated/common/runtime/DebugBindings.gen.cpp Line: 51)

PerfectClearAllBosses:Installed
 
(Filename: C:/buildslave/unity/build/artifacts/generated/common/runtime/DebugBindings.gen.cpp Line: 51)

PerfectClearAllMinibosses:Installed
 
(Filename: C:/buildslave/unity/build/artifacts/generated/common/runtime/DebugBindings.gen.cpp Line: 51)

ClearAllCondemnedBosses:Installed
 
(Filename: C:/buildslave/unity/build/artifacts/generated/common/runtime/DebugBindings.gen.cpp Line: 51)

CompleteAFloorWithNoDamage:Installed
 
(Filename: C:/buildslave/unity/build/artifacts/generated/common/runtime/DebugBindings.gen.cpp Line: 51)

CompleteARunWithoutBuyingItems:Installed
 
(Filename: C:/buildslave/unity/build/artifacts/generated/common/runtime/DebugBindings.gen.cpp Line: 51)

CompleteARunWithoutPickingUpAttachment:Installed
 
(Filename: C:/buildslave/unity/build/artifacts/generated/common/runtime/DebugBindings.gen.cpp Line: 51)

UnlockAllItems:Installed
 
(Filename: C:/buildslave/unity/build/artifacts/generated/common/runtime/DebugBindings.gen.cpp Line: 51)

FindAllItems:Installed
 
(Filename: C:/buildslave/unity/build/artifacts/generated/common/runtime/DebugBindings.gen.cpp Line: 51)

Kill1OfEveryRegualrEnemy:Installed
 
(Filename: C:/buildslave/unity/build/artifacts/generated/common/runtime/DebugBindings.gen.cpp Line: 51)

KillFinalBossWithMech_Blue:Installed
 
(Filename: C:/buildslave/unity/build/artifacts/generated/common/runtime/DebugBindings.gen.cpp Line: 51)

KillFinalBossWithMech_Green:Installed
 
(Filename: C:/buildslave/unity/build/artifacts/generated/common/runtime/DebugBindings.gen.cpp Line: 51)

KillFinalBossWithMech_Orange:Installed
 
(Filename: C:/buildslave/unity/build/artifacts/generated/common/runtime/DebugBindings.gen.cpp Line: 51)

KillFinalBossWithMech_PortalTip:Installed
 
(Filename: C:/buildslave/unity/build/artifacts/generated/common/runtime/DebugBindings.gen.cpp Line: 51)

KillFinalBossWithMech_RedBlack:Installed
 
(Filename: C:/buildslave/unity/build/artifacts/generated/common/runtime/DebugBindings.gen.cpp Line: 51)

KillFinalBossWithMech_White:Installed
 
(Filename: C:/buildslave/unity/build/artifacts/generated/common/runtime/DebugBindings.gen.cpp Line: 51)

KillFinalBossWithAllMechs:Installed
 
(Filename: C:/buildslave/unity/build/artifacts/generated/common/runtime/DebugBindings.gen.cpp Line: 51)

KillSuperFinalBossWithMech_Blue:Installed
 
(Filename: C:/buildslave/unity/build/artifacts/generated/common/runtime/DebugBindings.gen.cpp Line: 51)

KillSuperFinalBossWithMech_Green:Installed
 
(Filename: C:/buildslave/unity/build/artifacts/generated/common/runtime/DebugBindings.gen.cpp Line: 51)

KillSuperFinalBossWithMech_Orange:Installed
 
(Filename: C:/buildslave/unity/build/artifacts/generated/common/runtime/DebugBindings.gen.cpp Line: 51)

KillSuperFinalBossWithMech_PortalTip:Installed
 
(Filename: C:/buildslave/unity/build/artifacts/generated/common/runtime/DebugBindings.gen.cpp Line: 51)

KillSuperFinalBossWithMech_RedBlack:Installed
 
(Filename: C:/buildslave/unity/build/artifacts/generated/common/runtime/DebugBindings.gen.cpp Line: 51)

KillSuperFinalBossWithMech_White:Installed
 
(Filename: C:/buildslave/unity/build/artifacts/generated/common/runtime/DebugBindings.gen.cpp Line: 51)

KillSuperFinalBossWithAllMechs:Installed
 
(Filename: C:/buildslave/unity/build/artifacts/generated/common/runtime/DebugBindings.gen.cpp Line: 51)

KillShopkeeper:Installed
 
(Filename: C:/buildslave/unity/build/artifacts/generated/common/runtime/DebugBindings.gen.cpp Line: 51)

Have5FamiliarsAtOnce:Installed
 
(Filename: C:/buildslave/unity/build/artifacts/generated/common/runtime/DebugBindings.gen.cpp Line: 51)

CompleteARunWithIncredibility_LifeHarvester:Installed
 
(Filename: C:/buildslave/unity/build/artifacts/generated/common/runtime/DebugBindings.gen.cpp Line: 51)

CompleteARunWithIncredibility_ConsummateConsumer:Installed
 
(Filename: C:/buildslave/unity/build/artifacts/generated/common/runtime/DebugBindings.gen.cpp Line: 51)

CompleteARunWithIncredibility_Minimalist:Installed
 
(Filename: C:/buildslave/unity/build/artifacts/generated/common/runtime/DebugBindings.gen.cpp Line: 51)

CompleteARunWithIncredibility_TheOne:Installed
 
(Filename: C:/buildslave/unity/build/artifacts/generated/common/runtime/DebugBindings.gen.cpp Line: 51)

CompleteARunWithIncredibility_MagneticPersonality:Installed
 
(Filename: C:/buildslave/unity/build/artifacts/generated/common/runtime/DebugBindings.gen.cpp Line: 51)

CompleteARunWithIncredibility_Jaywalker:Installed
 
(Filename: C:/buildslave/unity/build/artifacts/generated/common/runtime/DebugBindings.gen.cpp Line: 51)

CompleteARunWithIncredibility_Confidence:Installed
 
(Filename: C:/buildslave/unity/build/artifacts/generated/common/runtime/DebugBindings.gen.cpp Line: 51)

CompleteARunWithIncredibility_RiskyAssassin:Installed
 
(Filename: C:/buildslave/unity/build/artifacts/generated/common/runtime/DebugBindings.gen.cpp Line: 51)

PerfectClearBoss_Invader:Installed
 
(Filename: C:/buildslave/unity/build/artifacts/generated/common/runtime/DebugBindings.gen.cpp Line: 51)

X1_PerfectClearBoss_Meridian:Installed
 
(Filename: C:/buildslave/unity/build/artifacts/generated/common/runtime/DebugBindings.gen.cpp Line: 51)

X1_PerfectClearBoss_Rive:Installed
 
(Filename: C:/buildslave/unity/build/artifacts/generated/common/runtime/DebugBindings.gen.cpp Line: 51)

X1_PerfectClearBoss_CircuitRondure:Installed
 
(Filename: C:/buildslave/unity/build/artifacts/generated/common/runtime/DebugBindings.gen.cpp Line: 51)

X1_PerfectClearBoss_Pandemonium:Installed
 
(Filename: C:/buildslave/unity/build/artifacts/generated/common/runtime/DebugBindings.gen.cpp Line: 51)

X1_PerfectClearBoss_Ent_Enemy_Reanimator:Installed
 
(Filename: C:/buildslave/unity/build/artifacts/generated/common/runtime/DebugBindings.gen.cpp Line: 51)

X1_PerfectClearBoss_Recast:Installed
 
(Filename: C:/buildslave/unity/build/artifacts/generated/common/runtime/DebugBindings.gen.cpp Line: 51)

X1_PerfectClearBoss_Nova:Installed
 
(Filename: C:/buildslave/unity/build/artifacts/generated/common/runtime/DebugBindings.gen.cpp Line: 51)

X1_PerfectClearBoss_CarrionEngine:Installed
 
(Filename: C:/buildslave/unity/build/artifacts/generated/common/runtime/DebugBindings.gen.cpp Line: 51)

X1_PerfectClearBoss_Javelin:Installed
 
(Filename: C:/buildslave/unity/build/artifacts/generated/common/runtime/DebugBindings.gen.cpp Line: 51)

X1_PerfectClearAllExpansion1Bosses:Installed
 
(Filename: C:/buildslave/unity/build/artifacts/generated/common/runtime/DebugBindings.gen.cpp Line: 51)

X1_KillFinalBossWithMech_Zephyr:Installed
 
(Filename: C:/buildslave/unity/build/artifacts/generated/common/runtime/DebugBindings.gen.cpp Line: 51)

X1_KillFinalBossWithMech_Warhog:Installed
 
(Filename: C:/buildslave/unity/build/artifacts/generated/common/runtime/DebugBindings.gen.cpp Line: 51)

X1_KillFinalBossWithMech_Paladin:Installed
 
(Filename: C:/buildslave/unity/build/artifacts/generated/common/runtime/DebugBindings.gen.cpp Line: 51)

X1_KillSuperFinalBossWithMech_Zephyr:Installed
 
(Filename: C:/buildslave/unity/build/artifacts/generated/common/runtime/DebugBindings.gen.cpp Line: 51)

X1_KillSuperFinalBossWithMech_Warhog:Installed
 
(Filename: C:/buildslave/unity/build/artifacts/generated/common/runtime/DebugBindings.gen.cpp Line: 51)

X1_KillSuperFinalBossWithMech_Paladin:Installed
 
(Filename: C:/buildslave/unity/build/artifacts/generated/common/runtime/DebugBindings.gen.cpp Line: 51)

KillFinalBossWithMech_Humble:Installed
 
(Filename: C:/buildslave/unity/build/artifacts/generated/common/runtime/DebugBindings.gen.cpp Line: 51)

KillFinalBossWithMech_Alpha:Installed
 
(Filename: C:/buildslave/unity/build/artifacts/generated/common/runtime/DebugBindings.gen.cpp Line: 51)

KillFinalBossWithMech_Penumbra:Installed
 
(Filename: C:/buildslave/unity/build/artifacts/generated/common/runtime/DebugBindings.gen.cpp Line: 51)

KillSuperFinalBossWithMech_Humble:Installed
 
(Filename: C:/buildslave/unity/build/artifacts/generated/common/runtime/DebugBindings.gen.cpp Line: 51)

KillSuperFinalBossWithMech_Alpha:Installed
 
(Filename: C:/buildslave/unity/build/artifacts/generated/common/runtime/DebugBindings.gen.cpp Line: 51)

KillSuperFinalBossWithMech_Penumbra:Installed
 
(Filename: C:/buildslave/unity/build/artifacts/generated/common/runtime/DebugBindings.gen.cpp Line: 51)

GameInit (1 - 6/5/2018 2:02:44 PM)
 
(Filename: C:/buildslave/unity/build/artifacts/generated/common/runtime/DebugBindings.gen.cpp Line: 51)

Version: 2.003
 
(Filename: C:/buildslave/unity/build/artifacts/generated/common/runtime/DebugBindings.gen.cpp Line: 51)

SoundsFromMods sound file count: 1
 
(Filename: C:/buildslave/unity/build/artifacts/generated/common/runtime/DebugBindings.gen.cpp Line: 51)

SoundsFromMods sound loading finished
 
(Filename: C:/buildslave/unity/build/artifacts/generated/common/runtime/DebugBindings.gen.cpp Line: 51)

GameInit (2 - 6/5/2018 2:02:47 PM)
 
(Filename: C:/buildslave/unity/build/artifacts/generated/common/runtime/DebugBindings.gen.cpp Line: 51)

GameInit (3 - 6/5/2018 2:02:47 PM)
 
(Filename: C:/buildslave/unity/build/artifacts/generated/common/runtime/DebugBindings.gen.cpp Line: 51)

DynamicHeapAllocator allocation probe 1 failed - Could not get memory for large allocation 1327108.
DynamicHeapAllocator allocation probe 2 failed - Could not get memory for large allocation 1327108.
DynamicHeapAllocator allocation probe 3 failed - Could not get memory for large allocation 1327108.
DynamicHeapAllocator allocation probe 4 failed - Could not get memory for large allocation 1327108.
DynamicHeapAllocator out of memory - Could not get memory for large allocation 1327108!
Could not allocate memory: System out of memory!
Trying to allocate: 1327108B with 16 alignment. MemoryLabel: Texture
Allocation happend at: Line:475 in 
Memory overview

[ ALLOC_DEFAULT ] used: 326246518B | peak: 0B | reserved: 331408906B 
[ ALLOC_TEMP_JOB ] used: 0B | peak: 0B | reserved: 2097152B 
[ ALLOC_GFX ] used: 1368063148B | peak: 0B | reserved: 1379393732B 
[ ALLOC_CACHEOBJECTS ] used: 427168B | peak: 0B | reserved: 10485760B 
[ ALLOC_TYPETREE ] used: 0B | peak: 0B | reserved: 0B 
[ ALLOC_PROFILER ] used: 0B | peak: 0B | reserved: 0B 
[ ALLOC_TEMP_THREAD ] used: 32768B | peak: 0B | reserved: 3112960B 
Could not allocate memory: System out of memory!
Trying to allocate: 1327108B with 16 alignment. MemoryLabel: Texture
Allocation happend at: Line:475 in 
Memory overview

[ ALLOC_DEFAULT ] used: 326246518B | peak: 0B | reserved: 331408906B 
[ ALLOC_TEMP_JOB ] used: 0B | peak: 0B | reserved: 2097152B 
[ ALLOC_GFX ] used: 1368063148B | peak: 0B | reserved: 1379393732B 
[ ALLOC_CACHEOBJECTS ] used: 427168B | peak: 0B | reserved: 10485760B 
[ ALLOC_TYPETREE ] used: 0B | peak: 0B | reserved: 0B 
[ ALLOC_PROFILER ] used: 0B | peak: 0B | reserved: 0B 
[ ALLOC_TEMP_THREAD ] used: 32768B | peak: 0B | reserved: 3112960B 

 
(Filename:  Line: 1045)

Crash!!!
SymInit: Symbol-SearchPath: '.;C:\Steam\steamapps\common\Starward Rogue;C:\Steam\steamapps\common\Starward Rogue;C:\WINDOWS;C:\WINDOWS\system32;SRV*C:\websymbols*http://msdl.microsoft.com/download/symbols;', symOptions: 530, UserName: 'gmivb'
OS-Version: 10.0.17134 () 0x100-0x1
C:\Steam\steamapps\common\Starward Rogue\StarwardRogue.exe:StarwardRogue.exe (010C0000), size: 19247104 (result: 0), SymType: '-exported-', PDB: 'C:\Steam\steamapps\common\Starward Rogue\StarwardRogue.exe', fileVersion: 2017.1.0.11279
C:\WINDOWS\SYSTEM32\ntdll.dll:ntdll.dll (77040000), size: 1638400 (result: 0), SymType: '-exported-', PDB: 'C:\WINDOWS\SYSTEM32\ntdll.dll', fileVersion: 10.0.17134.1
C:\WINDOWS\System32\KERNEL32.DLL:KERNEL32.DLL (75740000), size: 917504 (result: 0), SymType: '-exported-', PDB: 'C:\WINDOWS\System32\KERNEL32.DLL', fileVersion: 10.0.17134.1
C:\WINDOWS\System32\KERNELBASE.dll:KERNELBASE.dll (750B0000), size: 1978368 (result: 0), SymType: '-exported-', PDB: 'C:\WINDOWS\System32\KERNELBASE.dll', fileVersion: 10.0.17134.1
C:\WINDOWS\System32\USER32.dll:USER32.dll (73920000), size: 1626112 (result: 0), SymType: '-exported-', PDB: 'C:\WINDOWS\System32\USER32.dll', fileVersion: 10.0.17134.1
C:\WINDOWS\System32\win32u.dll:win32u.dll (74000000), size: 94208 (result: 0), SymType: '-exported-', PDB: 'C:\WINDOWS\System32\win32u.dll', fileVersion: 10.0.17134.1
C:\WINDOWS\SYSTEM32\HID.DLL:HID.DLL (67D40000), size: 40960 (result: 0), SymType: '-exported-', PDB: 'C:\WINDOWS\SYSTEM32\HID.DLL', fileVersion: 10.0.17134.1
C:\WINDOWS\System32\GDI32.dll:GDI32.dll (75400000), size: 139264 (result: 0), SymType: '-exported-', PDB: 'C:\WINDOWS\System32\GDI32.dll', fileVersion: 10.0.17134.1
C:\WINDOWS\System32\msvcrt.dll:msvcrt.dll (74470000), size: 782336 (result: 0), SymType: '-exported-', PDB: 'C:\WINDOWS\System32\msvcrt.dll', fileVersion: 7.0.17134.1
C:\WINDOWS\System32\gdi32full.dll:gdi32full.dll (76D80000), size: 1458176 (result: 0), SymType: '-exported-', PDB: 'C:\WINDOWS\System32\gdi32full.dll', fileVersion: 10.0.17134.81
C:\WINDOWS\System32\msvcp_win.dll:msvcp_win.dll (752A0000), size: 512000 (result: 0), SymType: '-exported-', PDB: 'C:\WINDOWS\System32\msvcp_win.dll', fileVersion: 10.0.17134.1
C:\WINDOWS\System32\ucrtbase.dll:ucrtbase.dll (75450000), size: 1171456 (result: 0), SymType: '-exported-', PDB: 'C:\WINDOWS\System32\ucrtbase.dll', fileVersion: 10.0.17134.1
C:\WINDOWS\System32\ole32.dll:ole32.dll (74FB0000), size: 1032192 (result: 0), SymType: '-exported-', PDB: 'C:\WINDOWS\System32\ole32.dll', fileVersion: 10.0.17134.1
C:\WINDOWS\System32\combase.dll:combase.dll (74530000), size: 2473984 (result: 0), SymType: '-exported-', PDB: 'C:\WINDOWS\System32\combase.dll', fileVersion: 10.0.17134.1
C:\WINDOWS\System32\RPCRT4.dll:RPCRT4.dll (74EC0000), size: 786432 (result: 0), SymType: '-exported-', PDB: 'C:\WINDOWS\System32\RPCRT4.dll', fileVersion: 10.0.17134.48
C:\WINDOWS\SYSTEM32\VERSION.dll:VERSION.dll (73800000), size: 32768 (result: 0), SymType: '-exported-', PDB: 'C:\WINDOWS\SYSTEM32\VERSION.dll', fileVersion: 10.0.17134.1
C:\WINDOWS\System32\SspiCli.dll:SspiCli.dll (73900000), size: 131072 (result: 0), SymType: '-exported-', PDB: 'C:\WINDOWS\System32\SspiCli.dll', fileVersion: 10.0.17134.1
C:\WINDOWS\System32\CRYPTBASE.dll:CRYPTBASE.dll (738F0000), size: 40960 (result: 0), SymType: '-exported-', PDB: 'C:\WINDOWS\System32\CRYPTBASE.dll', fileVersion: 10.0.17134.1
C:\WINDOWS\System32\bcryptPrimitives.dll:bcryptPrimitives.dll (756D0000), size: 360448 (result: 0), SymType: '-exported-', PDB: 'C:\WINDOWS\System32\bcryptPrimitives.dll', fileVersion: 10.0.17134.1
C:\WINDOWS\System32\sechost.dll:sechost.dll (74130000), size: 278528 (result: 0), SymType: '-exported-', PDB: 'C:\WINDOWS\System32\sechost.dll', fileVersion: 10.0.17134.1
C:\WINDOWS\System32\SHLWAPI.dll:SHLWAPI.dll (74180000), size: 282624 (result: 0), SymType: '-nosymbols-', PDB: 'C:\WINDOWS\System32\SHLWAPI.dll', fileVersion: 10.0.17134.1
C:\WINDOWS\System32\SETUPAPI.dll:SETUPAPI.dll (73AB0000), size: 4370432 (result: 0), SymType: '-nosymbols-', PDB: 'C:\WINDOWS\System32\SETUPAPI.dll', fileVersion: 10.0.17134.1
C:\WINDOWS\System32\cfgmgr32.dll:cfgmgr32.dll (74420000), size: 233472 (result: 0), SymType: '-exported-', PDB: 'C:\WINDOWS\System32\cfgmgr32.dll', fileVersion: 10.0.17134.1
C:\WINDOWS\System32\ADVAPI32.dll:ADVAPI32.dll (743A0000), size: 491520 (result: 0), SymType: '-nosymbols-', PDB: 'C:\WINDOWS\System32\ADVAPI32.dll', fileVersion: 10.0.17134.1
C:\WINDOWS\System32\SHELL32.dll:SHELL32.dll (75A30000), size: 20226048 (result: 0), SymType: '-nosymbols-', PDB: 'C:\WINDOWS\System32\SHELL32.dll', fileVersion: 10.0.17134.81
C:\WINDOWS\System32\shcore.dll:shcore.dll (74D50000), size: 561152 (result: 0), SymType: '-exported-', PDB: 'C:\WINDOWS\System32\shcore.dll', fileVersion: 10.0.17134.1
C:\WINDOWS\System32\windows.storage.dll:windows.storage.dll (74790000), size: 6004736 (result: 0), SymType: '-nosymbols-', PDB: 'C:\WINDOWS\System32\windows.storage.dll', fileVersion: 10.0.17134.81
C:\WINDOWS\System32\kernel.appcore.dll:kernel.appcore.dll (73FC0000), size: 61440 (result: 0), SymType: '-nosymbols-', PDB: 'C:\WINDOWS\System32\kernel.appcore.dll', fileVersion: 10.0.17134.1
C:\WINDOWS\System32\profapi.dll:profapi.dll (74F90000), size: 98304 (result: 0), SymType: '-nosymbols-', PDB: 'C:\WINDOWS\System32\profapi.dll', fileVersion: 10.0.17134.1
C:\WINDOWS\System32\powrprof.dll:powrprof.dll (753B0000), size: 282624 (result: 0), SymType: '-exported-', PDB: 'C:\WINDOWS\System32\powrprof.dll', fileVersion: 10.0.17134.1
C:\WINDOWS\System32\FLTLIB.DLL:FLTLIB.DLL (756C0000), size: 32768 (result: 0), SymType: '-exported-', PDB: 'C:\WINDOWS\System32\FLTLIB.DLL', fileVersion: 10.0.17134.1
C:\WINDOWS\System32\WS2_32.dll:WS2_32.dll (759C0000), size: 421888 (result: 0), SymType: '-nosymbols-', PDB: 'C:\WINDOWS\System32\WS2_32.dll', fileVersion: 10.0.17134.1
C:\WINDOWS\System32\OLEAUT32.dll:OLEAUT32.dll (74080000), size: 614400 (result: 0), SymType: '-nosymbols-', PDB: 'C:\WINDOWS\System32\OLEAUT32.dll', fileVersion: 10.0.17134.48
C:\WINDOWS\System32\IMM32.dll:IMM32.dll (73FD0000), size: 155648 (result: 0), SymType: '-nosymbols-', PDB: 'C:\WINDOWS\System32\IMM32.dll', fileVersion: 10.0.17134.1
C:\WINDOWS\SYSTEM32\OPENGL32.dll:OPENGL32.dll (66730000), size: 888832 (result: 0), SymType: '-nosymbols-', PDB: 'C:\WINDOWS\SYSTEM32\OPENGL32.dll', fileVersion: 10.0.17134.1
C:\WINDOWS\SYSTEM32\WINMM.dll:WINMM.dll (6B9E0000), size: 147456 (result: 0), SymType: '-nosymbols-', PDB: 'C:\WINDOWS\SYSTEM32\WINMM.dll', fileVersion: 10.0.17134.1
C:\WINDOWS\SYSTEM32\DNSAPI.dll:DNSAPI.dll (70060000), size: 581632 (result: 0), SymType: '-nosymbols-', PDB: 'C:\WINDOWS\SYSTEM32\DNSAPI.dll', fileVersion: 10.0.17134.1
C:\WINDOWS\SYSTEM32\IPHLPAPI.DLL:IPHLPAPI.DLL (700F0000), size: 196608 (result: 0), SymType: '-nosymbols-', PDB: 'C:\WINDOWS\SYSTEM32\IPHLPAPI.DLL', fileVersion: 10.0.17134.1
C:\WINDOWS\SYSTEM32\WINHTTP.dll:WINHTTP.dll (6DA40000), size: 720896 (result: 0), SymType: '-nosymbols-', PDB: 'C:\WINDOWS\SYSTEM32\WINHTTP.dll', fileVersion: 10.0.17134.1
C:\WINDOWS\SYSTEM32\GLU32.dll:GLU32.dll (65AB0000), size: 258048 (result: 0), SymType: '-nosymbols-', PDB: 'C:\WINDOWS\SYSTEM32\GLU32.dll', fileVersion: 10.0.17134.1
C:\WINDOWS\System32\NSI.dll:NSI.dll (74120000), size: 28672 (result: 0), SymType: '-nosymbols-', PDB: 'C:\WINDOWS\System32\NSI.dll', fileVersion: 10.0.17134.1
C:\WINDOWS\SYSTEM32\winmmbase.dll:winmmbase.dll (6B8B0000), size: 143360 (result: 0), SymType: '-nosymbols-', PDB: 'C:\WINDOWS\SYSTEM32\winmmbase.dll', fileVersion: 10.0.17134.1
C:\Steam\gameoverlayrenderer.dll:gameoverlayrenderer.dll (6BC40000), size: 1327104 (result: 0), SymType: '-nosymbols-', PDB: 'C:\Steam\gameoverlayrenderer.dll', fileVersion: 4.54.16.53
C:\WINDOWS\System32\PSAPI.DLL:PSAPI.DLL (74460000), size: 24576 (result: 0), SymType: '-nosymbols-', PDB: 'C:\WINDOWS\System32\PSAPI.DLL', fileVersion: 10.0.17134.1
C:\WINDOWS\system32\uxtheme.dll:uxtheme.dll (6BA10000), size: 507904 (result: 0), SymType: '-nosymbols-', PDB: 'C:\WINDOWS\system32\uxtheme.dll', fileVersion: 10.0.17134.1
C:\Steam\steamapps\common\Starward Rogue\StarwardRogue_Data\Mono\EmbedRuntime\mono.dll:mono.dll (10000000), size: 2289664 (result: 0), SymType: '-nosymbols-', PDB: 'C:\Steam\steamapps\common\Starward Rogue\StarwardRogue_Data\Mono\EmbedRuntime\mono.dll', fileVersion: 1.0.0.1
C:\WINDOWS\SYSTEM32\MSWSOCK.dll:MSWSOCK.dll (6FFB0000), size: 352256 (result: 0), SymType: '-nosymbols-', PDB: 'C:\WINDOWS\SYSTEM32\MSWSOCK.dll', fileVersion: 10.0.17134.1
C:\WINDOWS\System32\MSCTF.dll:MSCTF.dll (75570000), size: 1327104 (result: 0), SymType: '-nosymbols-', PDB: 'C:\WINDOWS\System32\MSCTF.dll', fileVersion: 10.0.17134.1
C:\WINDOWS\system32\dwmapi.dll:dwmapi.dll (6B970000), size: 143360 (result: 0), SymType: '-nosymbols-', PDB: 'C:\WINDOWS\system32\dwmapi.dll', fileVersion: 10.0.17134.1
C:\WINDOWS\SYSTEM32\d3d9.dll:d3d9.dll (5FF40000), size: 1503232 (result: 0), SymType: '-nosymbols-', PDB: 'C:\WINDOWS\SYSTEM32\d3d9.dll', fileVersion: 10.0.17134.81
C:\WINDOWS\System32\DriverStore\FileRepository\igdlh64.inf_amd64_bc75cebf5edbbc50\igdumdim32.dll:igdumdim32.dll (6BA90000), size: 1716224 (result: 0), SymType: '-nosymbols-', PDB: 'C:\WINDOWS\System32\DriverStore\FileRepository\igdlh64.inf_amd64_bc75cebf5edbbc50\igdumdim32.dll', fileVersion: 23.20.16.4973
C:\WINDOWS\System32\DriverStore\FileRepository\igdlh64.inf_amd64_bc75cebf5edbbc50\igd9dxva32.dll:igd9dxva32.dll (59FC0000), size: 48836608 (result: 0), SymType: '-nosymbols-', PDB: 'C:\WINDOWS\System32\DriverStore\FileRepository\igdlh64.inf_amd64_bc75cebf5edbbc50\igd9dxva32.dll', fileVersion: 23.20.16.4973
C:\WINDOWS\System32\DriverStore\FileRepository\igdlh64.inf_amd64_bc75cebf5edbbc50\igc32.dll:igc32.dll (585C0000), size: 27205632 (result: 0), SymType: '-nosymbols-', PDB: 'C:\WINDOWS\System32\DriverStore\FileRepository\igdlh64.inf_amd64_bc75cebf5edbbc50\igc32.dll', fileVersion: 23.20.16.4973
C:\WINDOWS\System32\clbcatq.dll:clbcatq.dll (74E30000), size: 536576 (result: 0), SymType: '-nosymbols-', PDB: 'C:\WINDOWS\System32\clbcatq.dll', fileVersion: 2001.12.10941.16384
C:\WINDOWS\System32\MMDevApi.dll:MMDevApi.dll (6A820000), size: 376832 (result: 0), SymType: '-nosymbols-', PDB: 'C:\WINDOWS\System32\MMDevApi.dll', fileVersion: 10.0.17134.1
C:\WINDOWS\System32\PROPSYS.dll:PROPSYS.dll (6E9A0000), size: 1572864 (result: 0), SymType: '-nosymbols-', PDB: 'C:\WINDOWS\System32\PROPSYS.dll', fileVersion: 7.0.17134.1
C:\WINDOWS\System32\DEVOBJ.dll:DEVOBJ.dll (6FF80000), size: 139264 (result: 0), SymType: '-nosymbols-', PDB: 'C:\WINDOWS\System32\DEVOBJ.dll', fileVersion: 10.0.17134.1
C:\WINDOWS\SYSTEM32\wdmaud.drv:wdmaud.drv (6A7E0000), size: 241664 (result: 0), SymType: '-nosymbols-', PDB: 'C:\WINDOWS\SYSTEM32\wdmaud.drv', fileVersion: 10.0.17134.1
C:\WINDOWS\SYSTEM32\AVRT.dll:AVRT.dll (6A7C0000), size: 32768 (result: 0), SymType: '-nosymbols-', PDB: 'C:\WINDOWS\SYSTEM32\AVRT.dll', fileVersion: 10.0.17134.1
C:\WINDOWS\SYSTEM32\ksuser.dll:ksuser.dll (6A7D0000), size: 28672 (result: 0), SymType: '-nosymbols-', PDB: 'C:\WINDOWS\SYSTEM32\ksuser.dll', fileVersion: 10.0.17134.1
C:\WINDOWS\SYSTEM32\AUDIOSES.DLL:AUDIOSES.DLL (6A6C0000), size: 1028096 (result: 0), SymType: '-nosymbols-', PDB: 'C:\WINDOWS\SYSTEM32\AUDIOSES.DLL', fileVersion: 10.0.17134.81
C:\WINDOWS\SYSTEM32\wintypes.dll:wintypes.dll (6E140000), size: 876544 (result: 0), SymType: '-nosymbols-', PDB: 'C:\WINDOWS\SYSTEM32\wintypes.dll', fileVersion: 10.0.17134.1
C:\WINDOWS\SYSTEM32\msacm32.drv:msacm32.drv (6A6B0000), size: 40960 (result: 0), SymType: '-nosymbols-', PDB: 'C:\WINDOWS\SYSTEM32\msacm32.drv', fileVersion: 10.0.17134.1
C:\WINDOWS\SYSTEM32\MSACM32.dll:MSACM32.dll (6B9A0000), size: 102400 (result: 0), SymType: '-nosymbols-', PDB: 'C:\WINDOWS\SYSTEM32\MSACM32.dll', fileVersion: 10.0.17134.1
C:\WINDOWS\SYSTEM32\midimap.dll:midimap.dll (6A6A0000), size: 32768 (result: 0), SymType: '-nosymbols-', PDB: 'C:\WINDOWS\SYSTEM32\midimap.dll', fileVersion: 10.0.17134.1
C:\WINDOWS\SYSTEM32\xinput1_3.dll:xinput1_3.dll (00400000), size: 90112 (result: 0), SymType: '-nosymbols-', PDB: 'C:\WINDOWS\SYSTEM32\xinput1_3.dll', fileVersion: 9.18.944.0
C:\WINDOWS\SYSTEM32\TextInputFramework.dll:TextInputFramework.dll (6A090000), size: 516096 (result: 0), SymType: '-nosymbols-', PDB: 'C:\WINDOWS\SYSTEM32\TextInputFramework.dll', fileVersion: 10.0.17134.1
C:\WINDOWS\SYSTEM32\CoreUIComponents.dll:CoreUIComponents.dll (69E30000), size: 2478080 (result: 0), SymType: '-nosymbols-', PDB: 'C:\WINDOWS\SYSTEM32\CoreUIComponents.dll', fileVersion: 10.0.17134.81
C:\WINDOWS\SYSTEM32\CoreMessaging.dll:CoreMessaging.dll (69DA0000), size: 569344 (result: 0), SymType: '-nosymbols-', PDB: 'C:\WINDOWS\SYSTEM32\CoreMessaging.dll', fileVersion: 10.0.17134.81
C:\WINDOWS\SYSTEM32\ntmarta.dll:ntmarta.dll (6D740000), size: 167936 (result: 0), SymType: '-nosymbols-', PDB: 'C:\WINDOWS\SYSTEM32\ntmarta.dll', fileVersion: 10.0.17134.1
C:\WINDOWS\system32\wbem\wbemprox.dll:wbemprox.dll (6DEE0000), size: 53248 (result: 0), SymType: '-nosymbols-', PDB: 'C:\WINDOWS\system32\wbem\wbemprox.dll', fileVersion: 10.0.17134.1
C:\WINDOWS\SYSTEM32\wbemcomn.dll:wbemcomn.dll (6DEF0000), size: 438272 (result: 0), SymType: '-nosymbols-', PDB: 'C:\WINDOWS\SYSTEM32\wbemcomn.dll', fileVersion: 10.0.17134.1
C:\WINDOWS\SYSTEM32\bcrypt.dll:bcrypt.dll (70170000), size: 102400 (result: 0), SymType: '-nosymbols-', PDB: 'C:\WINDOWS\SYSTEM32\bcrypt.dll', fileVersion: 10.0.17134.1
C:\WINDOWS\system32\wbem\wbemsvc.dll:wbemsvc.dll (6DED0000), size: 65536 (result: 0), SymType: '-nosymbols-', PDB: 'C:\WINDOWS\system32\wbem\wbemsvc.dll', fileVersion: 10.0.17134.1
C:\WINDOWS\system32\wbem\fastprox.dll:fastprox.dll (6DE00000), size: 798720 (result: 0), SymType: '-nosymbols-', PDB: 'C:\WINDOWS\system32\wbem\fastprox.dll', fileVersion: 10.0.17134.1
C:\WINDOWS\SYSTEM32\CRYPTSP.dll:CRYPTSP.dll (70150000), size: 77824 (result: 0), SymType: '-nosymbols-', PDB: 'C:\WINDOWS\SYSTEM32\CRYPTSP.dll', fileVersion: 10.0.17134.1
C:\WINDOWS\system32\rsaenh.dll:rsaenh.dll (70120000), size: 192512 (result: 0), SymType: '-nosymbols-', PDB: 'C:\WINDOWS\system32\rsaenh.dll', fileVersion: 10.0.17134.1
C:\WINDOWS\SYSTEM32\dhcpcsvc6.DLL:dhcpcsvc6.DLL (70040000), size: 77824 (result: 0), SymType: '-nosymbols-', PDB: 'C:\WINDOWS\SYSTEM32\dhcpcsvc6.DLL', fileVersion: 10.0.17134.1
C:\WINDOWS\SYSTEM32\dhcpcsvc.DLL:dhcpcsvc.DLL (70020000), size: 81920 (result: 0), SymType: '-nosymbols-', PDB: 'C:\WINDOWS\SYSTEM32\dhcpcsvc.DLL', fileVersion: 10.0.17134.1
C:\Windows\System32\rasadhlp.dll:rasadhlp.dll (6D870000), size: 32768 (result: 0), SymType: '-nosymbols-', PDB: 'C:\Windows\System32\rasadhlp.dll', fileVersion: 10.0.17134.1
C:\WINDOWS\System32\fwpuclnt.dll:fwpuclnt.dll (6D820000), size: 323584 (result: 0), SymType: '-nosymbols-', PDB: 'C:\WINDOWS\System32\fwpuclnt.dll', fileVersion: 10.0.17134.1
C:\Steam\steamapps\common\Starward Rogue\StarwardRogue_Data\Plugins\XInputInterface32.dll:XInputInterface32.dll (6B8E0000), size: 77824 (result: 0), SymType: '-nosymbols-', PDB: 'C:\Steam\steamapps\common\Starward Rogue\StarwardRogue_Data\Plugins\XInputInterface32.dll'
C:\WINDOWS\System32\WINTRUST.dll:WINTRUST.dll (74DE0000), size: 290816 (result: 0), SymType: '-nosymbols-', PDB: 'C:\WINDOWS\System32\WINTRUST.dll', fileVersion: 10.0.17134.81
C:\WINDOWS\System32\MSASN1.dll:MSASN1.dll (74F80000), size: 57344 (result: 0), SymType: '-nosymbols-', PDB: 'C:\WINDOWS\System32\MSASN1.dll', fileVersion: 10.0.17134.1
C:\WINDOWS\System32\CRYPT32.dll:CRYPT32.dll (75820000), size: 1662976 (result: 0), SymType: '-nosymbols-', PDB: 'C:\WINDOWS\System32\CRYPT32.dll', fileVersion: 10.0.17134.1
C:\Steam\steamapps\common\Starward Rogue\StarwardRogue_Data\Plugins\CSteamworks.dll:CSteamworks.dll (6B880000), size: 135168 (result: 0), SymType: '-nosymbols-', PDB: 'C:\Steam\steamapps\common\Starward Rogue\StarwardRogue_Data\Plugins\CSteamworks.dll', fileVersion: 1.7.0.0
C:\Steam\steamapps\common\Starward Rogue\steam_api.dll:steam_api.dll (6B860000), size: 122880 (result: 0), SymType: '-nosymbols-', PDB: 'C:\Steam\steamapps\common\Starward Rogue\steam_api.dll', fileVersion: 2.19.34.93
C:\Steam\steamclient.dll:steamclient.dll (5DDD0000), size: 12296192 (result: 0), SymType: '-nosymbols-', PDB: 'C:\Steam\steamclient.dll', fileVersion: 4.54.16.53
C:\WINDOWS\System32\imagehlp.dll:imagehlp.dll (75430000), size: 102400 (result: 0), SymType: '-nosymbols-', PDB: 'C:\WINDOWS\System32\imagehlp.dll', fileVersion: 10.0.17134.1
C:\Steam\tier0_s.dll:tier0_s.dll (67E80000), size: 626688 (result: 0), SymType: '-nosymbols-', PDB: 'C:\Steam\tier0_s.dll', fileVersion: 4.54.16.53
C:\Steam\vstdlib_s.dll:vstdlib_s.dll (67D50000), size: 380928 (result: 0), SymType: '-nosymbols-', PDB: 'C:\Steam\vstdlib_s.dll', fileVersion: 4.54.16.53
C:\WINDOWS\SYSTEM32\Secur32.dll:Secur32.dll (6D810000), size: 40960 (result: 0), SymType: '-nosymbols-', PDB: 'C:\WINDOWS\SYSTEM32\Secur32.dll', fileVersion: 10.0.17134.1
C:\Steam\steam.dll:steam.dll (6B790000), size: 794624 (result: 0), SymType: '-nosymbols-', PDB: 'C:\Steam\steam.dll'
C:\Steam\Steam2.dll:Steam2.dll (6B140000), size: 2887680 (result: 0), SymType: '-nosymbols-', PDB: 'C:\Steam\Steam2.dll', fileVersion: 2.0.2117.156
C:\WINDOWS\system32\napinsp.dll:napinsp.dll (6C330000), size: 69632 (result: 0), SymType: '-nosymbols-', PDB: 'C:\WINDOWS\system32\napinsp.dll', fileVersion: 10.0.17134.1
C:\WINDOWS\system32\pnrpnsp.dll:pnrpnsp.dll (6C310000), size: 90112 (result: 0), SymType: '-nosymbols-', PDB: 'C:\WINDOWS\system32\pnrpnsp.dll', fileVersion: 10.0.17134.1
C:\WINDOWS\system32\NLAapi.dll:NLAapi.dll (6C2F0000), size: 77824 (result: 0), SymType: '-nosymbols-', PDB: 'C:\WINDOWS\system32\NLAapi.dll', fileVersion: 10.0.17134.1
C:\WINDOWS\System32\winrnr.dll:winrnr.dll (6C2E0000), size: 49152 (result: 0), SymType: '-nosymbols-', PDB: 'C:\WINDOWS\System32\winrnr.dll', fileVersion: 10.0.17134.1
C:\Steam\DbgHelp.dll:DbgHelp.dll (6B670000), size: 1134592 (result: 0), SymType: '-nosymbols-', PDB: 'C:\Steam\DbgHelp.dll', fileVersion: 6.7.5.0
C:\Steam\CSERHelper.dll:CSERHelper.dll (6B640000), size: 135168 (result: 0), SymType: '-nosymbols-', PDB: 'C:\Steam\CSERHelper.dll', fileVersion: 4.50.0.0
C:\Windows\System32\Windows.UI.dll:Windows.UI.dll (69C30000), size: 888832 (result: 0), SymType: '-nosymbols-', PDB: 'C:\Windows\System32\Windows.UI.dll', fileVersion: 10.0.17134.1
C:\Windows\System32\InputHost.dll:InputHost.dll (69BD0000), size: 368640 (result: 0), SymType: '-nosymbols-', PDB: 'C:\Windows\System32\InputHost.dll'

========== OUTPUTING STACK TRACE ==================

  ERROR: SymGetSymFromAddr64, GetLastError: 'Попытка обращения к неверному адресу.' (Address: 01F0CD95)
0x01F0CD95 (StarwardRogue) 
  ERROR: SymGetSymFromAddr64, GetLastError: 'Попытка обращения к неверному адресу.' (Address: 0199CD10)
0x0199CD10 (StarwardRogue) 
  ERROR: SymGetSymFromAddr64, GetLastError: 'Попытка обращения к неверному адресу.' (Address: 019962C2)
0x019962C2 (StarwardRogue) 
  ERROR: SymGetSymFromAddr64, GetLastError: 'Попытка обращения к неверному адресу.' (Address: 01996359)
0x01996359 (StarwardRogue) 
  ERROR: SymGetSymFromAddr64, GetLastError: 'Попытка обращения к неверному адресу.' (Address: 01122AE6)
0x01122AE6 (StarwardRogue) 
  ERROR: SymGetSymFromAddr64, GetLastError: 'Попытка обращения к неверному адресу.' (Address: 01123D89)
0x01123D89 (StarwardRogue) 
  ERROR: SymGetSymFromAddr64, GetLastError: 'Попытка обращения к неверному адресу.' (Address: 011240B5)
0x011240B5 (StarwardRogue) 
  ERROR: SymGetSymFromAddr64, GetLastError: 'Попытка обращения к неверному адресу.' (Address: 011243BC)
0x011243BC (StarwardRogue) 
  ERROR: SymGetSymFromAddr64, GetLastError: 'Попытка обращения к неверному адресу.' (Address: 0194ED43)
0x0194ED43 (StarwardRogue) 
0x06EEAC30 (Mono JIT Code) (wrapper managed-to-native) UnityEngine.ImageConversion:LoadImage (UnityEngine.Texture2D,byte[],bool)
0x06EEABEE (Mono JIT Code) UnityEngine.ImageConversion:LoadImage (UnityEngine.Texture2D,byte[])
0x28C99B24 (Mono JIT Code) GameImage:FinishLoadTextureFromFileAsync ()
0x06F227AC (Mono JIT Code) GameImage:CheckLoad ()
0x06F2160C (Mono JIT Code) Game:UpdateStreaming ()
0x06EC1923 (Mono JIT Code) ArcenMainCameraImplementations:MainUpdateLogic ()
0x06EC1023 (Mono JIT Code) MainCameraLogic:Update ()
0x06E4F041 (Mono JIT Code) (wrapper runtime-invoke) object:runtime_invoke_void__this__ (object,intptr,intptr,intptr)
  ERROR: SymGetSymFromAddr64, GetLastError: 'Попытка обращения к неверному адресу.' (Address: 100F1AE7)
0x100F1AE7 (mono) 
  ERROR: SymGetSymFromAddr64, GetLastError: 'Попытка обращения к неверному адресу.' (Address: 1005DAC3)
0x1005DAC3 (mono) 
  ERROR: SymGetSymFromAddr64, GetLastError: 'Попытка обращения к неверному адресу.' (Address: 016B3FB0)
0x016B3FB0 (StarwardRogue) 
  ERROR: SymGetSymFromAddr64, GetLastError: 'Попытка обращения к неверному адресу.' (Address: 016B0792)
0x016B0792 (StarwardRogue) 
  ERROR: SymGetSymFromAddr64, GetLastError: 'Попытка обращения к неверному адресу.' (Address: 0156B75E)
0x0156B75E (StarwardRogue) 
  ERROR: SymGetSymFromAddr64, GetLastError: 'Попытка обращения к неверному адресу.' (Address: 01573191)
0x01573191 (StarwardRogue) 
  ERROR: SymGetSymFromAddr64, GetLastError: 'Попытка обращения к неверному адресу.' (Address: 015731A7)
0x015731A7 (StarwardRogue) 
  ERROR: SymGetSymFromAddr64, GetLastError: 'Попытка обращения к неверному адресу.' (Address: 0154EE2C)
0x0154EE2C (StarwardRogue) 
  ERROR: SymGetSymFromAddr64, GetLastError: 'Попытка обращения к неверному адресу.' (Address: 0116DA1E)
0x0116DA1E (StarwardRogue) 
  ERROR: SymGetSymFromAddr64, GetLastError: 'Попытка обращения к неверному адресу.' (Address: 0197F3A8)
0x0197F3A8 (StarwardRogue) 
  ERROR: SymGetSymFromAddr64, GetLastError: 'Попытка обращения к неверному адресу.' (Address: 01F0241D)
0x01F0241D (StarwardRogue) 
0x75758484 (KERNEL32) BaseThreadInitThunk
0x770A2EC0 (ntdll) RtlValidSecurityDescriptor
0x770A2E90 (ntdll) RtlValidSecurityDescriptor

========== END OF STACKTRACE ===========

**** Crash! ****
output_log-2.txt (43,973 bytes)

patsancheg

Jun 7, 2018 11:02 am

reporter   ~0047559

version: 2.004
Another crash at the beginning of floor 6. Files attached.

output_log-3.txt (66,863 bytes)
Initialize engine version: 2017.1.0p4 (892c0f8d8f8a)
GfxDevice: creating device client; threaded=1
Direct3D:
    Version:  Direct3D 9.0c [igdumdim32.dll 23.20.16.4973]
    Renderer: Intel(R) HD Graphics 630
    Vendor:   Intel
    VRAM:     2111 MB (via DXGI)
    Caps:     Shader=30 DepthRT=1 NativeDepth=1 NativeShadow=1 DF16=1 INTZ=1 NULL=1 RESZ=1 SlowINTZ=0 ATOC=1 BC4=1 BC5=1
Begin MonoManager ReloadAssembly
Platform assembly: C:\Steam\steamapps\common\Starward Rogue\StarwardRogue_Data\Managed\UnityEngine.dll (this message is harmless)
Loading C:\Steam\steamapps\common\Starward Rogue\StarwardRogue_Data\Managed\UnityEngine.dll into Unity Child Domain
Platform assembly: C:\Steam\steamapps\common\Starward Rogue\StarwardRogue_Data\Managed\I18N.dll (this message is harmless)
Platform assembly: C:\Steam\steamapps\common\Starward Rogue\StarwardRogue_Data\Managed\I18N.Other.dll (this message is harmless)
Platform assembly: C:\Steam\steamapps\common\Starward Rogue\StarwardRogue_Data\Managed\Assembly-CSharp.dll (this message is harmless)
Loading C:\Steam\steamapps\common\Starward Rogue\StarwardRogue_Data\Managed\Assembly-CSharp.dll into Unity Child Domain
Platform assembly: C:\Steam\steamapps\common\Starward Rogue\StarwardRogue_Data\Managed\UnityEngine.UI.dll (this message is harmless)
Loading C:\Steam\steamapps\common\Starward Rogue\StarwardRogue_Data\Managed\UnityEngine.UI.dll into Unity Child Domain
Platform assembly: C:\Steam\steamapps\common\Starward Rogue\StarwardRogue_Data\Managed\UnityEngine.Networking.dll (this message is harmless)
Loading C:\Steam\steamapps\common\Starward Rogue\StarwardRogue_Data\Managed\UnityEngine.Networking.dll into Unity Child Domain
Platform assembly: C:\Steam\steamapps\common\Starward Rogue\StarwardRogue_Data\Managed\UnityEngine.Timeline.dll (this message is harmless)
Loading C:\Steam\steamapps\common\Starward Rogue\StarwardRogue_Data\Managed\UnityEngine.Timeline.dll into Unity Child Domain
Platform assembly: C:\Steam\steamapps\common\Starward Rogue\StarwardRogue_Data\Managed\Ionic.Zip.Reduced.dll (this message is harmless)
Loading C:\Steam\steamapps\common\Starward Rogue\StarwardRogue_Data\Managed\Ionic.Zip.Reduced.dll into Unity Child Domain
Platform assembly: C:\Steam\steamapps\common\Starward Rogue\StarwardRogue_Data\Managed\ExcelLibrary.dll (this message is harmless)
Loading C:\Steam\steamapps\common\Starward Rogue\StarwardRogue_Data\Managed\ExcelLibrary.dll into Unity Child Domain
Platform assembly: C:\Steam\steamapps\common\Starward Rogue\StarwardRogue_Data\Managed\I18N.CJK.dll (this message is harmless)
Loading C:\Steam\steamapps\common\Starward Rogue\StarwardRogue_Data\Managed\I18N.CJK.dll into Unity Child Domain
Platform assembly: C:\Steam\steamapps\common\Starward Rogue\StarwardRogue_Data\Managed\I18N.dll (this message is harmless)
Loading C:\Steam\steamapps\common\Starward Rogue\StarwardRogue_Data\Managed\I18N.dll into Unity Child Domain
Platform assembly: C:\Steam\steamapps\common\Starward Rogue\StarwardRogue_Data\Managed\I18N.MidEast.dll (this message is harmless)
Loading C:\Steam\steamapps\common\Starward Rogue\StarwardRogue_Data\Managed\I18N.MidEast.dll into Unity Child Domain
Platform assembly: C:\Steam\steamapps\common\Starward Rogue\StarwardRogue_Data\Managed\I18N.Other.dll (this message is harmless)
Loading C:\Steam\steamapps\common\Starward Rogue\StarwardRogue_Data\Managed\I18N.Other.dll into Unity Child Domain
Platform assembly: C:\Steam\steamapps\common\Starward Rogue\StarwardRogue_Data\Managed\I18N.Rare.dll (this message is harmless)
Loading C:\Steam\steamapps\common\Starward Rogue\StarwardRogue_Data\Managed\I18N.Rare.dll into Unity Child Domain
Platform assembly: C:\Steam\steamapps\common\Starward Rogue\StarwardRogue_Data\Managed\I18N.West.dll (this message is harmless)
Loading C:\Steam\steamapps\common\Starward Rogue\StarwardRogue_Data\Managed\I18N.West.dll into Unity Child Domain
Platform assembly: C:\Steam\steamapps\common\Starward Rogue\StarwardRogue_Data\Managed\System.Drawing.dll (this message is harmless)
Loading C:\Steam\steamapps\common\Starward Rogue\StarwardRogue_Data\Managed\System.Drawing.dll into Unity Child Domain
Platform assembly: C:\Steam\steamapps\common\Starward Rogue\StarwardRogue_Data\Managed\Steamworks.NET.dll (this message is harmless)
Loading C:\Steam\steamapps\common\Starward Rogue\StarwardRogue_Data\Managed\Steamworks.NET.dll into Unity Child Domain
Platform assembly: C:\Steam\steamapps\common\Starward Rogue\StarwardRogue_Data\Managed\Steamworks.NET.dll (this message is harmless)
Loading C:\Steam\steamapps\common\Starward Rogue\StarwardRogue_Data\Managed\Steamworks.NET.dll into Unity Child Domain
Platform assembly: C:\Steam\steamapps\common\Starward Rogue\StarwardRogue_Data\Managed\System.dll (this message is harmless)
Platform assembly: C:\Steam\steamapps\common\Starward Rogue\StarwardRogue_Data\Managed\System.Core.dll (this message is harmless)
- Completed reload, in  0.088 seconds
WARNING: Shader Unsupported: 'Hidden/VR/BlitCopyFromTexArray' - Pass '' has no vertex shader
WARNING: Shader Unsupported: 'Hidden/VR/BlitCopyFromTexArray' - Setting to default shader.
<RI> Initializing input.

<RI> Input initialized.

<RI> Initialized touch support.

UnloadTime: 1.310293 ms
Fallback handler could not load library C:/Steam/steamapps/common/Starward Rogue/StarwardRogue_Data/Mono/XInputInterface64
Fallback handler could not load library C:/Steam/steamapps/common/Starward Rogue/StarwardRogue_Data/Mono/.\XInputInterface64
Fallback handler could not load library C:/Steam/steamapps/common/Starward Rogue/StarwardRogue_Data/Mono/XInputInterface64
Fallback handler could not load library C:/Steam/steamapps/common/Starward Rogue/StarwardRogue_Data/Mono/libXInputInterface64
Fallback handler could not load library C:/Steam/steamapps/common/Starward Rogue/StarwardRogue_Data/Mono/.\libXInputInterface64
Fallback handler could not load library C:/Steam/steamapps/common/Starward Rogue/StarwardRogue_Data/Mono/libXInputInterface64
Steamworks Init
 
(Filename: C:/buildslave/unity/build/artifacts/generated/common/runtime/DebugBindings.gen.cpp Line: 51)

Steamworks IsRunning: True
 
(Filename: C:/buildslave/unity/build/artifacts/generated/common/runtime/DebugBindings.gen.cpp Line: 51)

graphicsShaderLevel:30
graphicsDeviceID:22802
graphicsDeviceName:Intel(R) HD Graphics 630
graphicsDeviceVendor:Intel
graphicsDeviceVendorID:32902
graphicsDeviceVersion:Direct3D 9.0c [igdumdim32.dll 23.20.16.4973]
graphicsMemorySize:2111
graphicsMultiThreaded:True
operatingSystem:Windows 10  (10.0.0) 64bit
processorCount:4
processorType:Intel(R) Core(TM) i5-7400T CPU @ 2.40GHz
processorFrequency:2400 mHz
supportsImageEffects:True
supportsShadows:True
maxTextureSize:8192
npotSupport:Full
systemMemorySize:8084
 
(Filename: C:/buildslave/unity/build/artifacts/generated/common/runtime/DebugBindings.gen.cpp Line: 51)

Platform assembly: C:\Steam\steamapps\common\Starward Rogue\StarwardRogue_Data\Managed\System.Xml.dll (this message is harmless)
Steamworks Init
 
(Filename: C:/buildslave/unity/build/artifacts/generated/common/runtime/DebugBindings.gen.cpp Line: 51)

Steamworks IsRunning: True
 
(Filename: C:/buildslave/unity/build/artifacts/generated/common/runtime/DebugBindings.gen.cpp Line: 51)

GameInit (0 - 6/7/2018 5:00:50 PM)
 
(Filename: C:/buildslave/unity/build/artifacts/generated/common/runtime/DebugBindings.gen.cpp Line: 51)

Expansion 1 music installed.
 
(Filename: C:/buildslave/unity/build/artifacts/generated/common/runtime/DebugBindings.gen.cpp Line: 51)

GameInit (1 - 6/7/2018 5:00:58 PM)
 
(Filename: C:/buildslave/unity/build/artifacts/generated/common/runtime/DebugBindings.gen.cpp Line: 51)

Version: 2.004
 
(Filename: C:/buildslave/unity/build/artifacts/generated/common/runtime/DebugBindings.gen.cpp Line: 51)

SoundsFromMods sound file count: 1
 
(Filename: C:/buildslave/unity/build/artifacts/generated/common/runtime/DebugBindings.gen.cpp Line: 51)

SoundsFromMods sound loading finished
 
(Filename: C:/buildslave/unity/build/artifacts/generated/common/runtime/DebugBindings.gen.cpp Line: 51)

GameInit (2 - 6/7/2018 5:01:01 PM)
 
(Filename: C:/buildslave/unity/build/artifacts/generated/common/runtime/DebugBindings.gen.cpp Line: 51)

GameInit (3 - 6/7/2018 5:01:02 PM)
 
(Filename: C:/buildslave/unity/build/artifacts/generated/common/runtime/DebugBindings.gen.cpp Line: 51)

d3d: failed to create 2D texture id=9697 w=1920 h=1080 mips=1 d3dfmt=21 [out of memory]
File Images/Tilesets/DarkShip/SubTilesets/HarshMachinery/FloorDecorations/Scuffs10_Dict error: System.ExecutionEngineException: Couldn't create thread
  at (wrapper managed-to-native) object:__icall_wrapper_mono_delegate_begin_invoke (object,intptr)
  at (wrapper delegate-begin-invoke) System.Threading.WaitCallback:begin_invoke_IAsyncResult__this___object_AsyncCallback_object (object,System.AsyncCallback,object)
  at System.Threading.ThreadPool.QueueUserWorkItem (System.Threading.WaitCallback callBack, System.Object state) [0x00000] in <filename unknown>:0 
  at System.Threading.ThreadPool.QueueUserWorkItem (System.Threading.WaitCallback callBack) [0x00000] in <filename unknown>:0 
  at ArcenAsyncFile.StartLoad (ArcenAsyncDataType ReadDataType, System.String Filename) [0x00000] in <filename unknown>:0 
  at GameImage.StartLoading () [0x00000] in <filename unknown>:0 
 
(Filename: C:/buildslave/unity/build/artifacts/generated/common/runtime/DebugBindings.gen.cpp Line: 51)

StartLoading Error (async: 853):    System.ExecutionEngineException: Couldn't create thread
  at (wrapper managed-to-native) object:__icall_wrapper_mono_delegate_begin_invoke (object,intptr)
  at (wrapper delegate-begin-invoke) System.Threading.WaitCallback:begin_invoke_IAsyncResult__this___object_AsyncCallback_object (object,System.AsyncCallback,object)
  at System.Threading.ThreadPool.QueueUserWorkItem (System.Threading.WaitCallback callBack, System.Object state) [0x00000] in <filename unknown>:0 
  at System.Threading.ThreadPool.QueueUserWorkItem (System.Threading.WaitCallback callBack) [0x00000] in <filename unknown>:0 
  at ArcenAsyncFile.StartLoad (ArcenAsyncDataType ReadDataType, System.String Filename) [0x00000] in <filename unknown>:0 
  at GameImage.StartLoading () [0x00000] in <filename unknown>:0 
 
(Filename: C:/buildslave/unity/build/artifacts/generated/common/runtime/DebugBindings.gen.cpp Line: 51)

File Images/Tilesets/DarkShip/SubTilesets/HarshMachinery/FloorDecorations/Scuffs9_Dict error: System.ExecutionEngineException: Couldn't create thread
  at (wrapper managed-to-native) object:__icall_wrapper_mono_delegate_begin_invoke (object,intptr)
  at (wrapper delegate-begin-invoke) System.Threading.WaitCallback:begin_invoke_IAsyncResult__this___object_AsyncCallback_object (object,System.AsyncCallback,object)
  at System.Threading.ThreadPool.QueueUserWorkItem (System.Threading.WaitCallback callBack, System.Object state) [0x00000] in <filename unknown>:0 
  at System.Threading.ThreadPool.QueueUserWorkItem (System.Threading.WaitCallback callBack) [0x00000] in <filename unknown>:0 
  at ArcenAsyncFile.StartLoad (ArcenAsyncDataType ReadDataType, System.String Filename) [0x00000] in <filename unknown>:0 
  at GameImage.StartLoading () [0x00000] in <filename unknown>:0 
 
(Filename: C:/buildslave/unity/build/artifacts/generated/common/runtime/DebugBindings.gen.cpp Line: 51)

StartLoading Error (async: 854):    System.ExecutionEngineException: Couldn't create thread
  at (wrapper managed-to-native) object:__icall_wrapper_mono_delegate_begin_invoke (object,intptr)
  at (wrapper delegate-begin-invoke) System.Threading.WaitCallback:begin_invoke_IAsyncResult__this___object_AsyncCallback_object (object,System.AsyncCallback,object)
  at System.Threading.ThreadPool.QueueUserWorkItem (System.Threading.WaitCallback callBack, System.Object state) [0x00000] in <filename unknown>:0 
  at System.Threading.ThreadPool.QueueUserWorkItem (System.Threading.WaitCallback callBack) [0x00000] in <filename unknown>:0 
  at ArcenAsyncFile.StartLoad (ArcenAsyncDataType ReadDataType, System.String Filename) [0x00000] in <filename unknown>:0 
  at GameImage.StartLoading () [0x00000] in <filename unknown>:0 
 
(Filename: C:/buildslave/unity/build/artifacts/generated/common/runtime/DebugBindings.gen.cpp Line: 51)

File Images/Tilesets/DarkShip/SubTilesets/HarshMachinery/FloorDecorations/Scuffs8_Dict error: System.ExecutionEngineException: Couldn't create thread
  at (wrapper managed-to-native) object:__icall_wrapper_mono_delegate_begin_invoke (object,intptr)
  at (wrapper delegate-begin-invoke) System.Threading.WaitCallback:begin_invoke_IAsyncResult__this___object_AsyncCallback_object (object,System.AsyncCallback,object)
  at System.Threading.ThreadPool.QueueUserWorkItem (System.Threading.WaitCallback callBack, System.Object state) [0x00000] in <filename unknown>:0 
  at System.Threading.ThreadPool.QueueUserWorkItem (System.Threading.WaitCallback callBack) [0x00000] in <filename unknown>:0 
  at ArcenAsyncFile.StartLoad (ArcenAsyncDataType ReadDataType, System.String Filename) [0x00000] in <filename unknown>:0 
  at GameImage.StartLoading () [0x00000] in <filename unknown>:0 
 
(Filename: C:/buildslave/unity/build/artifacts/generated/common/runtime/DebugBindings.gen.cpp Line: 51)

StartLoading Error (async: 855):    System.ExecutionEngineException: Couldn't create thread
  at (wrapper managed-to-native) object:__icall_wrapper_mono_delegate_begin_invoke (object,intptr)
  at (wrapper delegate-begin-invoke) System.Threading.WaitCallback:begin_invoke_IAsyncResult__this___object_AsyncCallback_object (object,System.AsyncCallback,object)
  at System.Threading.ThreadPool.QueueUserWorkItem (System.Threading.WaitCallback callBack, System.Object state) [0x00000] in <filename unknown>:0 
  at System.Threading.ThreadPool.QueueUserWorkItem (System.Threading.WaitCallback callBack) [0x00000] in <filename unknown>:0 
  at ArcenAsyncFile.StartLoad (ArcenAsyncDataType ReadDataType, System.String Filename) [0x00000] in <filename unknown>:0 
  at GameImage.StartLoading () [0x00000] in <filename unknown>:0 
 
(Filename: C:/buildslave/unity/build/artifacts/generated/common/runtime/DebugBindings.gen.cpp Line: 51)

File Images/Tilesets/DarkShip/SubTilesets/HarshMachinery/FloorDecorations/Scuffs7_Dict error: System.ExecutionEngineException: Couldn't create thread
  at (wrapper managed-to-native) object:__icall_wrapper_mono_delegate_begin_invoke (object,intptr)
  at (wrapper delegate-begin-invoke) System.Threading.WaitCallback:begin_invoke_IAsyncResult__this___object_AsyncCallback_object (object,System.AsyncCallback,object)
  at System.Threading.ThreadPool.QueueUserWorkItem (System.Threading.WaitCallback callBack, System.Object state) [0x00000] in <filename unknown>:0 
  at System.Threading.ThreadPool.QueueUserWorkItem (System.Threading.WaitCallback callBack) [0x00000] in <filename unknown>:0 
  at ArcenAsyncFile.StartLoad (ArcenAsyncDataType ReadDataType, System.String Filename) [0x00000] in <filename unknown>:0 
  at GameImage.StartLoading () [0x00000] in <filename unknown>:0 
 
(Filename: C:/buildslave/unity/build/artifacts/generated/common/runtime/DebugBindings.gen.cpp Line: 51)

StartLoading Error (async: 856):    System.ExecutionEngineException: Couldn't create thread
  at (wrapper managed-to-native) object:__icall_wrapper_mono_delegate_begin_invoke (object,intptr)
  at (wrapper delegate-begin-invoke) System.Threading.WaitCallback:begin_invoke_IAsyncResult__this___object_AsyncCallback_object (object,System.AsyncCallback,object)
  at System.Threading.ThreadPool.QueueUserWorkItem (System.Threading.WaitCallback callBack, System.Object state) [0x00000] in <filename unknown>:0 
  at System.Threading.ThreadPool.QueueUserWorkItem (System.Threading.WaitCallback callBack) [0x00000] in <filename unknown>:0 
  at ArcenAsyncFile.StartLoad (ArcenAsyncDataType ReadDataType, System.String Filename) [0x00000] in <filename unknown>:0 
  at GameImage.StartLoading () [0x00000] in <filename unknown>:0 
 
(Filename: C:/buildslave/unity/build/artifacts/generated/common/runtime/DebugBindings.gen.cpp Line: 51)

File Images/Tilesets/DarkShip/SubTilesets/HarshMachinery/FloorDecorations/Scuffs6_Dict error: System.ExecutionEngineException: Couldn't create thread
  at (wrapper managed-to-native) object:__icall_wrapper_mono_delegate_begin_invoke (object,intptr)
  at (wrapper delegate-begin-invoke) System.Threading.WaitCallback:begin_invoke_IAsyncResult__this___object_AsyncCallback_object (object,System.AsyncCallback,object)
  at System.Threading.ThreadPool.QueueUserWorkItem (System.Threading.WaitCallback callBack, System.Object state) [0x00000] in <filename unknown>:0 
  at System.Threading.ThreadPool.QueueUserWorkItem (System.Threading.WaitCallback callBack) [0x00000] in <filename unknown>:0 
  at ArcenAsyncFile.StartLoad (ArcenAsyncDataType ReadDataType, System.String Filename) [0x00000] in <filename unknown>:0 
  at GameImage.StartLoading () [0x00000] in <filename unknown>:0 
 
(Filename: C:/buildslave/unity/build/artifacts/generated/common/runtime/DebugBindings.gen.cpp Line: 51)

StartLoading Error (async: 857):    System.ExecutionEngineException: Couldn't create thread
  at (wrapper managed-to-native) object:__icall_wrapper_mono_delegate_begin_invoke (object,intptr)
  at (wrapper delegate-begin-invoke) System.Threading.WaitCallback:begin_invoke_IAsyncResult__this___object_AsyncCallback_object (object,System.AsyncCallback,object)
  at System.Threading.ThreadPool.QueueUserWorkItem (System.Threading.WaitCallback callBack, System.Object state) [0x00000] in <filename unknown>:0 
  at System.Threading.ThreadPool.QueueUserWorkItem (System.Threading.WaitCallback callBack) [0x00000] in <filename unknown>:0 
  at ArcenAsyncFile.StartLoad (ArcenAsyncDataType ReadDataType, System.String Filename) [0x00000] in <filename unknown>:0 
  at GameImage.StartLoading () [0x00000] in <filename unknown>:0 
 
(Filename: C:/buildslave/unity/build/artifacts/generated/common/runtime/DebugBindings.gen.cpp Line: 51)

File Images/Tilesets/DarkShip/SubTilesets/HarshMachinery/FloorDecorations/Scuffs5_Dict error: System.ExecutionEngineException: Couldn't create thread
  at (wrapper managed-to-native) object:__icall_wrapper_mono_delegate_begin_invoke (object,intptr)
  at (wrapper delegate-begin-invoke) System.Threading.WaitCallback:begin_invoke_IAsyncResult__this___object_AsyncCallback_object (object,System.AsyncCallback,object)
  at System.Threading.ThreadPool.QueueUserWorkItem (System.Threading.WaitCallback callBack, System.Object state) [0x00000] in <filename unknown>:0 
  at System.Threading.ThreadPool.QueueUserWorkItem (System.Threading.WaitCallback callBack) [0x00000] in <filename unknown>:0 
  at ArcenAsyncFile.StartLoad (ArcenAsyncDataType ReadDataType, System.String Filename) [0x00000] in <filename unknown>:0 
  at GameImage.StartLoading () [0x00000] in <filename unknown>:0 
 
(Filename: C:/buildslave/unity/build/artifacts/generated/common/runtime/DebugBindings.gen.cpp Line: 51)

StartLoading Error (async: 858):    System.ExecutionEngineException: Couldn't create thread
  at (wrapper managed-to-native) object:__icall_wrapper_mono_delegate_begin_invoke (object,intptr)
  at (wrapper delegate-begin-invoke) System.Threading.WaitCallback:begin_invoke_IAsyncResult__this___object_AsyncCallback_object (object,System.AsyncCallback,object)
  at System.Threading.ThreadPool.QueueUserWorkItem (System.Threading.WaitCallback callBack, System.Object state) [0x00000] in <filename unknown>:0 
  at System.Threading.ThreadPool.QueueUserWorkItem (System.Threading.WaitCallback callBack) [0x00000] in <filename unknown>:0 
  at ArcenAsyncFile.StartLoad (ArcenAsyncDataType ReadDataType, System.String Filename) [0x00000] in <filename unknown>:0 
  at GameImage.StartLoading () [0x00000] in <filename unknown>:0 
 
(Filename: C:/buildslave/unity/build/artifacts/generated/common/runtime/DebugBindings.gen.cpp Line: 51)

File Images/Tilesets/DarkShip/SubTilesets/HarshMachinery/FloorDecorations/Scuffs4_Dict error: System.ExecutionEngineException: Couldn't create thread
  at (wrapper managed-to-native) object:__icall_wrapper_mono_delegate_begin_invoke (object,intptr)
  at (wrapper delegate-begin-invoke) System.Threading.WaitCallback:begin_invoke_IAsyncResult__this___object_AsyncCallback_object (object,System.AsyncCallback,object)
  at System.Threading.ThreadPool.QueueUserWorkItem (System.Threading.WaitCallback callBack, System.Object state) [0x00000] in <filename unknown>:0 
  at System.Threading.ThreadPool.QueueUserWorkItem (System.Threading.WaitCallback callBack) [0x00000] in <filename unknown>:0 
  at ArcenAsyncFile.StartLoad (ArcenAsyncDataType ReadDataType, System.String Filename) [0x00000] in <filename unknown>:0 
  at GameImage.StartLoading () [0x00000] in <filename unknown>:0 
 
(Filename: C:/buildslave/unity/build/artifacts/generated/common/runtime/DebugBindings.gen.cpp Line: 51)

StartLoading Error (async: 859):    System.ExecutionEngineException: Couldn't create thread
  at (wrapper managed-to-native) object:__icall_wrapper_mono_delegate_begin_invoke (object,intptr)
  at (wrapper delegate-begin-invoke) System.Threading.WaitCallback:begin_invoke_IAsyncResult__this___object_AsyncCallback_object (object,System.AsyncCallback,object)
  at System.Threading.ThreadPool.QueueUserWorkItem (System.Threading.WaitCallback callBack, System.Object state) [0x00000] in <filename unknown>:0 
  at System.Threading.ThreadPool.QueueUserWorkItem (System.Threading.WaitCallback callBack) [0x00000] in <filename unknown>:0 
  at ArcenAsyncFile.StartLoad (ArcenAsyncDataType ReadDataType, System.String Filename) [0x00000] in <filename unknown>:0 
  at GameImage.StartLoading () [0x00000] in <filename unknown>:0 
 
(Filename: C:/buildslave/unity/build/artifacts/generated/common/runtime/DebugBindings.gen.cpp Line: 51)

File Images/Tilesets/DarkShip/SubTilesets/HarshMachinery/FloorDecorations/Scuffs3_Dict error: System.ExecutionEngineException: Couldn't create thread
  at (wrapper managed-to-native) object:__icall_wrapper_mono_delegate_begin_invoke (object,intptr)
  at (wrapper delegate-begin-invoke) System.Threading.WaitCallback:begin_invoke_IAsyncResult__this___object_AsyncCallback_object (object,System.AsyncCallback,object)
  at System.Threading.ThreadPool.QueueUserWorkItem (System.Threading.WaitCallback callBack, System.Object state) [0x00000] in <filename unknown>:0 
  at System.Threading.ThreadPool.QueueUserWorkItem (System.Threading.WaitCallback callBack) [0x00000] in <filename unknown>:0 
  at ArcenAsyncFile.StartLoad (ArcenAsyncDataType ReadDataType, System.String Filename) [0x00000] in <filename unknown>:0 
  at GameImage.StartLoading () [0x00000] in <filename unknown>:0 
 
(Filename: C:/buildslave/unity/build/artifacts/generated/common/runtime/DebugBindings.gen.cpp Line: 51)

StartLoading Error (async: 860):    System.ExecutionEngineException: Couldn't create thread
  at (wrapper managed-to-native) object:__icall_wrapper_mono_delegate_begin_invoke (object,intptr)
  at (wrapper delegate-begin-invoke) System.Threading.WaitCallback:begin_invoke_IAsyncResult__this___object_AsyncCallback_object (object,System.AsyncCallback,object)
  at System.Threading.ThreadPool.QueueUserWorkItem (System.Threading.WaitCallback callBack, System.Object state) [0x00000] in <filename unknown>:0 
  at System.Threading.ThreadPool.QueueUserWorkItem (System.Threading.WaitCallback callBack) [0x00000] in <filename unknown>:0 
  at ArcenAsyncFile.StartLoad (ArcenAsyncDataType ReadDataType, System.String Filename) [0x00000] in <filename unknown>:0 
  at GameImage.StartLoading () [0x00000] in <filename unknown>:0 
 
(Filename: C:/buildslave/unity/build/artifacts/generated/common/runtime/DebugBindings.gen.cpp Line: 51)

File Images/Tilesets/DarkShip/SubTilesets/HarshMachinery/FloorDecorations/Scuffs2_Dict error: System.ExecutionEngineException: Couldn't create thread
  at (wrapper managed-to-native) object:__icall_wrapper_mono_delegate_begin_invoke (object,intptr)
  at (wrapper delegate-begin-invoke) System.Threading.WaitCallback:begin_invoke_IAsyncResult__this___object_AsyncCallback_object (object,System.AsyncCallback,object)
  at System.Threading.ThreadPool.QueueUserWorkItem (System.Threading.WaitCallback callBack, System.Object state) [0x00000] in <filename unknown>:0 
  at System.Threading.ThreadPool.QueueUserWorkItem (System.Threading.WaitCallback callBack) [0x00000] in <filename unknown>:0 
  at ArcenAsyncFile.StartLoad (ArcenAsyncDataType ReadDataType, System.String Filename) [0x00000] in <filename unknown>:0 
  at GameImage.StartLoading () [0x00000] in <filename unknown>:0 
 
(Filename: C:/buildslave/unity/build/artifacts/generated/common/runtime/DebugBindings.gen.cpp Line: 51)

StartLoading Error (async: 861):    System.ExecutionEngineException: Couldn't create thread
  at (wrapper managed-to-native) object:__icall_wrapper_mono_delegate_begin_invoke (object,intptr)
  at (wrapper delegate-begin-invoke) System.Threading.WaitCallback:begin_invoke_IAsyncResult__this___object_AsyncCallback_object (object,System.AsyncCallback,object)
  at System.Threading.ThreadPool.QueueUserWorkItem (System.Threading.WaitCallback callBack, System.Object state) [0x00000] in <filename unknown>:0 
  at System.Threading.ThreadPool.QueueUserWorkItem (System.Threading.WaitCallback callBack) [0x00000] in <filename unknown>:0 
  at ArcenAsyncFile.StartLoad (ArcenAsyncDataType ReadDataType, System.String Filename) [0x00000] in <filename unknown>:0 
  at GameImage.StartLoading () [0x00000] in <filename unknown>:0 
 
(Filename: C:/buildslave/unity/build/artifacts/generated/common/runtime/DebugBindings.gen.cpp Line: 51)

File Images/Tilesets/DarkShip/SubTilesets/HarshMachinery/FloorDecorations/Scuffs1_Dict error: System.ExecutionEngineException: Couldn't create thread
  at (wrapper managed-to-native) object:__icall_wrapper_mono_delegate_begin_invoke (object,intptr)
  at (wrapper delegate-begin-invoke) System.Threading.WaitCallback:begin_invoke_IAsyncResult__this___object_AsyncCallback_object (object,System.AsyncCallback,object)
  at System.Threading.ThreadPool.QueueUserWorkItem (System.Threading.WaitCallback callBack, System.Object state) [0x00000] in <filename unknown>:0 
  at System.Threading.ThreadPool.QueueUserWorkItem (System.Threading.WaitCallback callBack) [0x00000] in <filename unknown>:0 
  at ArcenAsyncFile.StartLoad (ArcenAsyncDataType ReadDataType, System.String Filename) [0x00000] in <filename unknown>:0 
  at GameImage.StartLoading () [0x00000] in <filename unknown>:0 
 
(Filename: C:/buildslave/unity/build/artifacts/generated/common/runtime/DebugBindings.gen.cpp Line: 51)

StartLoading Error (async: 862):    System.ExecutionEngineException: Couldn't create thread
  at (wrapper managed-to-native) object:__icall_wrapper_mono_delegate_begin_invoke (object,intptr)
  at (wrapper delegate-begin-invoke) System.Threading.WaitCallback:begin_invoke_IAsyncResult__this___object_AsyncCallback_object (object,System.AsyncCallback,object)
  at System.Threading.ThreadPool.QueueUserWorkItem (System.Threading.WaitCallback callBack, System.Object state) [0x00000] in <filename unknown>:0 
  at System.Threading.ThreadPool.QueueUserWorkItem (System.Threading.WaitCallback callBack) [0x00000] in <filename unknown>:0 
  at ArcenAsyncFile.StartLoad (ArcenAsyncDataType ReadDataType, System.String Filename) [0x00000] in <filename unknown>:0 
  at GameImage.StartLoading () [0x00000] in <filename unknown>:0 
 
(Filename: C:/buildslave/unity/build/artifacts/generated/common/runtime/DebugBindings.gen.cpp Line: 51)

File Images/Tilesets/DarkShip/SubTilesets/HarshMachinery/ShootableC_Dict error: System.ExecutionEngineException: Couldn't create thread
  at (wrapper managed-to-native) object:__icall_wrapper_mono_delegate_begin_invoke (object,intptr)
  at (wrapper delegate-begin-invoke) System.Threading.WaitCallback:begin_invoke_IAsyncResult__this___object_AsyncCallback_object (object,System.AsyncCallback,object)
  at System.Threading.ThreadPool.QueueUserWorkItem (System.Threading.WaitCallback callBack, System.Object state) [0x00000] in <filename unknown>:0 
  at System.Threading.ThreadPool.QueueUserWorkItem (System.Threading.WaitCallback callBack) [0x00000] in <filename unknown>:0 
  at ArcenAsyncFile.StartLoad (ArcenAsyncDataType ReadDataType, System.String Filename) [0x00000] in <filename unknown>:0 
  at GameImage.StartLoading () [0x00000] in <filename unknown>:0 
 
(Filename: C:/buildslave/unity/build/artifacts/generated/common/runtime/DebugBindings.gen.cpp Line: 51)

StartLoading Error (async: 863):    System.ExecutionEngineException: Couldn't create thread
  at (wrapper managed-to-native) object:__icall_wrapper_mono_delegate_begin_invoke (object,intptr)
  at (wrapper delegate-begin-invoke) System.Threading.WaitCallback:begin_invoke_IAsyncResult__this___object_AsyncCallback_object (object,System.AsyncCallback,object)
  at System.Threading.ThreadPool.QueueUserWorkItem (System.Threading.WaitCallback callBack, System.Object state) [0x00000] in <filename unknown>:0 
  at System.Threading.ThreadPool.QueueUserWorkItem (System.Threading.WaitCallback callBack) [0x00000] in <filename unknown>:0 
  at ArcenAsyncFile.StartLoad (ArcenAsyncDataType ReadDataType, System.String Filename) [0x00000] in <filename unknown>:0 
  at GameImage.StartLoading () [0x00000] in <filename unknown>:0 
 
(Filename: C:/buildslave/unity/build/artifacts/generated/common/runtime/DebugBindings.gen.cpp Line: 51)

File Images/Tilesets/DarkShip/SubTilesets/HarshMachinery/ShootableB_Dict error: System.ExecutionEngineException: Couldn't create thread
  at (wrapper managed-to-native) object:__icall_wrapper_mono_delegate_begin_invoke (object,intptr)
  at (wrapper delegate-begin-invoke) System.Threading.WaitCallback:begin_invoke_IAsyncResult__this___object_AsyncCallback_object (object,System.AsyncCallback,object)
  at System.Threading.ThreadPool.QueueUserWorkItem (System.Threading.WaitCallback callBack, System.Object state) [0x00000] in <filename unknown>:0 
  at System.Threading.ThreadPool.QueueUserWorkItem (System.Threading.WaitCallback callBack) [0x00000] in <filename unknown>:0 
  at ArcenAsyncFile.StartLoad (ArcenAsyncDataType ReadDataType, System.String Filename) [0x00000] in <filename unknown>:0 
  at GameImage.StartLoading () [0x00000] in <filename unknown>:0 
 
(Filename: C:/buildslave/unity/build/artifacts/generated/common/runtime/DebugBindings.gen.cpp Line: 51)

StartLoading Error (async: 864):    System.ExecutionEngineException: Couldn't create thread
  at (wrapper managed-to-native) object:__icall_wrapper_mono_delegate_begin_invoke (object,intptr)
  at (wrapper delegate-begin-invoke) System.Threading.WaitCallback:begin_invoke_IAsyncResult__this___object_AsyncCallback_object (object,System.AsyncCallback,object)
  at System.Threading.ThreadPool.QueueUserWorkItem (System.Threading.WaitCallback callBack, System.Object state) [0x00000] in <filename unknown>:0 
  at System.Threading.ThreadPool.QueueUserWorkItem (System.Threading.WaitCallback callBack) [0x00000] in <filename unknown>:0 
  at ArcenAsyncFile.StartLoad (ArcenAsyncDataType ReadDataType, System.String Filename) [0x00000] in <filename unknown>:0 
  at GameImage.StartLoading () [0x00000] in <filename unknown>:0 
 
(Filename: C:/buildslave/unity/build/artifacts/generated/common/runtime/DebugBindings.gen.cpp Line: 51)

File Images/Tilesets/DarkShip/SubTilesets/HarshMachinery/ShootableA_Dict error: System.ExecutionEngineException: Couldn't create thread
  at (wrapper managed-to-native) object:__icall_wrapper_mono_delegate_begin_invoke (object,intptr)
  at (wrapper delegate-begin-invoke) System.Threading.WaitCallback:begin_invoke_IAsyncResult__this___object_AsyncCallback_object (object,System.AsyncCallback,object)
  at System.Threading.ThreadPool.QueueUserWorkItem (System.Threading.WaitCallback callBack, System.Object state) [0x00000] in <filename unknown>:0 
  at System.Threading.ThreadPool.QueueUserWorkItem (System.Threading.WaitCallback callBack) [0x00000] in <filename unknown>:0 
  at ArcenAsyncFile.StartLoad (ArcenAsyncDataType ReadDataType, System.String Filename) [0x00000] in <filename unknown>:0 
  at GameImage.StartLoading () [0x00000] in <filename unknown>:0 
 
(Filename: C:/buildslave/unity/build/artifacts/generated/common/runtime/DebugBindings.gen.cpp Line: 51)

StartLoading Error (async: 865):    System.ExecutionEngineException: Couldn't create thread
  at (wrapper managed-to-native) object:__icall_wrapper_mono_delegate_begin_invoke (object,intptr)
  at (wrapper delegate-begin-invoke) System.Threading.WaitCallback:begin_invoke_IAsyncResult__this___object_AsyncCallback_object (object,System.AsyncCallback,object)
  at System.Threading.ThreadPool.QueueUserWorkItem (System.Threading.WaitCallback callBack, System.Object state) [0x00000] in <filename unknown>:0 
  at System.Threading.ThreadPool.QueueUserWorkItem (System.Threading.WaitCallback callBack) [0x00000] in <filename unknown>:0 
  at ArcenAsyncFile.StartLoad (ArcenAsyncDataType ReadDataType, System.String Filename) [0x00000] in <filename unknown>:0 
  at GameImage.StartLoading () [0x00000] in <filename unknown>:0 
 
(Filename: C:/buildslave/unity/build/artifacts/generated/common/runtime/DebugBindings.gen.cpp Line: 51)

File Images/Tilesets/DarkShip/SubTilesets/HarshMachinery/FloorAngledEdges_Dict error: System.ExecutionEngineException: Couldn't create thread
  at (wrapper managed-to-native) object:__icall_wrapper_mono_delegate_begin_invoke (object,intptr)
  at (wrapper delegate-begin-invoke) System.Threading.WaitCallback:begin_invoke_IAsyncResult__this___object_AsyncCallback_object (object,System.AsyncCallback,object)
  at System.Threading.ThreadPool.QueueUserWorkItem (System.Threading.WaitCallback callBack, System.Object state) [0x00000] in <filename unknown>:0 
  at System.Threading.ThreadPool.QueueUserWorkItem (System.Threading.WaitCallback callBack) [0x00000] in <filename unknown>:0 
  at ArcenAsyncFile.StartLoad (ArcenAsyncDataType ReadDataType, System.String Filename) [0x00000] in <filename unknown>:0 
  at GameImage.StartLoading () [0x00000] in <filename unknown>:0 
 
(Filename: C:/buildslave/unity/build/artifacts/generated/common/runtime/DebugBindings.gen.cpp Line: 51)

StartLoading Error (async: 866):    System.ExecutionEngineException: Couldn't create thread
  at (wrapper managed-to-native) object:__icall_wrapper_mono_delegate_begin_invoke (object,intptr)
  at (wrapper delegate-begin-invoke) System.Threading.WaitCallback:begin_invoke_IAsyncResult__this___object_AsyncCallback_object (object,System.AsyncCallback,object)
  at System.Threading.ThreadPool.QueueUserWorkItem (System.Threading.WaitCallback callBack, System.Object state) [0x00000] in <filename unknown>:0 
  at System.Threading.ThreadPool.QueueUserWorkItem (System.Threading.WaitCallback callBack) [0x00000] in <filename unknown>:0 
  at ArcenAsyncFile.StartLoad (ArcenAsyncDataType ReadDataType, System.String Filename) [0x00000] in <filename unknown>:0 
  at GameImage.StartLoading () [0x00000] in <filename unknown>:0 
 
(Filename: C:/buildslave/unity/build/artifacts/generated/common/runtime/DebugBindings.gen.cpp Line: 51)

File Images/Tilesets/DarkShip/SubTilesets/HarshMachinery/FloorEdges_Dict error: System.ExecutionEngineException: Couldn't create thread
  at (wrapper managed-to-native) object:__icall_wrapper_mono_delegate_begin_invoke (object,intptr)
  at (wrapper delegate-begin-invoke) System.Threading.WaitCallback:begin_invoke_IAsyncResult__this___object_AsyncCallback_object (object,System.AsyncCallback,object)
  at System.Threading.ThreadPool.QueueUserWorkItem (System.Threading.WaitCallback callBack, System.Object state) [0x00000] in <filename unknown>:0 
  at System.Threading.ThreadPool.QueueUserWorkItem (System.Threading.WaitCallback callBack) [0x00000] in <filename unknown>:0 
  at ArcenAsyncFile.StartLoad (ArcenAsyncDataType ReadDataType, System.String Filename) [0x00000] in <filename unknown>:0 
  at GameImage.StartLoading () [0x00000] in <filename unknown>:0 
 
(Filename: C:/buildslave/unity/build/artifacts/generated/common/runtime/DebugBindings.gen.cpp Line: 51)

StartLoading Error (async: 867):    System.ExecutionEngineException: Couldn't create thread
  at (wrapper managed-to-native) object:__icall_wrapper_mono_delegate_begin_invoke (object,intptr)
  at (wrapper delegate-begin-invoke) System.Threading.WaitCallback:begin_invoke_IAsyncResult__this___object_AsyncCallback_object (object,System.AsyncCallback,object)
  at System.Threading.ThreadPool.QueueUserWorkItem (System.Threading.WaitCallback callBack, System.Object state) [0x00000] in <filename unknown>:0 
  at System.Threading.ThreadPool.QueueUserWorkItem (System.Threading.WaitCallback callBack) [0x00000] in <filename unknown>:0 
  at ArcenAsyncFile.StartLoad (ArcenAsyncDataType ReadDataType, System.String Filename) [0x00000] in <filename unknown>:0 
  at GameImage.StartLoading () [0x00000] in <filename unknown>:0 
 
(Filename: C:/buildslave/unity/build/artifacts/generated/common/runtime/DebugBindings.gen.cpp Line: 51)

File Images/Tilesets/DarkShip/WallOverhead error: System.ExecutionEngineException: Couldn't create thread
  at (wrapper managed-to-native) object:__icall_wrapper_mono_delegate_begin_invoke (object,intptr)
  at (wrapper delegate-begin-invoke) System.Threading.WaitCallback:begin_invoke_IAsyncResult__this___object_AsyncCallback_object (object,System.AsyncCallback,object)
  at System.Threading.ThreadPool.QueueUserWorkItem (System.Threading.WaitCallback callBack, System.Object state) [0x00000] in <filename unknown>:0 
  at System.Threading.ThreadPool.QueueUserWorkItem (System.Threading.WaitCallback callBack) [0x00000] in <filename unknown>:0 
  at ArcenAsyncFile.StartLoad (ArcenAsyncDataType ReadDataType, System.String Filename) [0x00000] in <filename unknown>:0 
  at GameImage.StartLoading () [0x00000] in <filename unknown>:0 
 
(Filename: C:/buildslave/unity/build/artifacts/generated/common/runtime/DebugBindings.gen.cpp Line: 51)

StartLoading Error (async: 868):    System.ExecutionEngineException: Couldn't create thread
  at (wrapper managed-to-native) object:__icall_wrapper_mono_delegate_begin_invoke (object,intptr)
  at (wrapper delegate-begin-invoke) System.Threading.WaitCallback:begin_invoke_IAsyncResult__this___object_AsyncCallback_object (object,System.AsyncCallback,object)
  at System.Threading.ThreadPool.QueueUserWorkItem (System.Threading.WaitCallback callBack, System.Object state) [0x00000] in <filename unknown>:0 
  at System.Threading.ThreadPool.QueueUserWorkItem (System.Threading.WaitCallback callBack) [0x00000] in <filename unknown>:0 
  at ArcenAsyncFile.StartLoad (ArcenAsyncDataType ReadDataType, System.String Filename) [0x00000] in <filename unknown>:0 
  at GameImage.StartLoading () [0x00000] in <filename unknown>:0 
 
(Filename: C:/buildslave/unity/build/artifacts/generated/common/runtime/DebugBindings.gen.cpp Line: 51)

File Images/Tilesets/DarkShip/Starfields/ScrapLarge_Dict error: System.ExecutionEngineException: Couldn't create thread
  at (wrapper managed-to-native) object:__icall_wrapper_mono_delegate_begin_invoke (object,intptr)
  at (wrapper delegate-begin-invoke) System.Threading.WaitCallback:begin_invoke_IAsyncResult__this___object_AsyncCallback_object (object,System.AsyncCallback,object)
  at System.Threading.ThreadPool.QueueUserWorkItem (System.Threading.WaitCallback callBack, System.Object state) [0x00000] in <filename unknown>:0 
  at System.Threading.ThreadPool.QueueUserWorkItem (System.Threading.WaitCallback callBack) [0x00000] in <filename unknown>:0 
  at ArcenAsyncFile.StartLoad (ArcenAsyncDataType ReadDataType, System.String Filename) [0x00000] in <filename unknown>:0 
  at GameImage.StartLoading () [0x00000] in <filename unknown>:0 
 
(Filename: C:/buildslave/unity/build/artifacts/generated/common/runtime/DebugBindings.gen.cpp Line: 51)

StartLoading Error (async: 869):    System.ExecutionEngineException: Couldn't create thread
  at (wrapper managed-to-native) object:__icall_wrapper_mono_delegate_begin_invoke (object,intptr)
  at (wrapper delegate-begin-invoke) System.Threading.WaitCallback:begin_invoke_IAsyncResult__this___object_AsyncCallback_object (object,System.AsyncCallback,object)
  at System.Threading.ThreadPool.QueueUserWorkItem (System.Threading.WaitCallback callBack, System.Object state) [0x00000] in <filename unknown>:0 
  at System.Threading.ThreadPool.QueueUserWorkItem (System.Threading.WaitCallback callBack) [0x00000] in <filename unknown>:0 
  at ArcenAsyncFile.StartLoad (ArcenAsyncDataType ReadDataType, System.String Filename) [0x00000] in <filename unknown>:0 
  at GameImage.StartLoading () [0x00000] in <filename unknown>:0 
 
(Filename: C:/buildslave/unity/build/artifacts/generated/common/runtime/DebugBindings.gen.cpp Line: 51)

File Images/Tilesets/DarkShip/Starfields/ScrapSmall_Dict error: System.ExecutionEngineException: Couldn't create thread
  at (wrapper managed-to-native) object:__icall_wrapper_mono_delegate_begin_invoke (object,intptr)
  at (wrapper delegate-begin-invoke) System.Threading.WaitCallback:begin_invoke_IAsyncResult__this___object_AsyncCallback_object (object,System.AsyncCallback,object)
  at System.Threading.ThreadPool.QueueUserWorkItem (System.Threading.WaitCallback callBack, System.Object state) [0x00000] in <filename unknown>:0 
  at System.Threading.ThreadPool.QueueUserWorkItem (System.Threading.WaitCallback callBack) [0x00000] in <filename unknown>:0 
  at ArcenAsyncFile.StartLoad (ArcenAsyncDataType ReadDataType, System.String Filename) [0x00000] in <filename unknown>:0 
  at GameImage.StartLoading () [0x00000] in <filename unknown>:0 
 
(Filename: C:/buildslave/unity/build/artifacts/generated/common/runtime/DebugBindings.gen.cpp Line: 51)

StartLoading Error (async: 870):    System.ExecutionEngineException: Couldn't create thread
  at (wrapper managed-to-native) object:__icall_wrapper_mono_delegate_begin_invoke (object,intptr)
  at (wrapper delegate-begin-invoke) System.Threading.WaitCallback:begin_invoke_IAsyncResult__this___object_AsyncCallback_object (object,System.AsyncCallback,object)
  at System.Threading.ThreadPool.QueueUserWorkItem (System.Threading.WaitCallback callBack, System.Object state) [0x00000] in <filename unknown>:0 
  at System.Threading.ThreadPool.QueueUserWorkItem (System.Threading.WaitCallback callBack) [0x00000] in <filename unknown>:0 
  at ArcenAsyncFile.StartLoad (ArcenAsyncDataType ReadDataType, System.String Filename) [0x00000] in <filename unknown>:0 
  at GameImage.StartLoading () [0x00000] in <filename unknown>:0 
 
(Filename: C:/buildslave/unity/build/artifacts/generated/common/runtime/DebugBindings.gen.cpp Line: 51)

File Images/Tilesets/DarkShip/Starfields/Glass error: System.ExecutionEngineException: Couldn't create thread
  at (wrapper managed-to-native) object:__icall_wrapper_mono_delegate_begin_invoke (object,intptr)
  at (wrapper delegate-begin-invoke) System.Threading.WaitCallback:begin_invoke_IAsyncResult__this___object_AsyncCallback_object (object,System.AsyncCallback,object)
  at System.Threading.ThreadPool.QueueUserWorkItem (System.Threading.WaitCallback callBack, System.Object state) [0x00000] in <filename unknown>:0 
  at System.Threading.ThreadPool.QueueUserWorkItem (System.Threading.WaitCallback callBack) [0x00000] in <filename unknown>:0 
  at ArcenAsyncFile.StartLoad (ArcenAsyncDataType ReadDataType, System.String Filename) [0x00000] in <filename unknown>:0 
  at GameImage.StartLoading () [0x00000] in <filename unknown>:0 
 
(Filename: C:/buildslave/unity/build/artifacts/generated/common/runtime/DebugBindings.gen.cpp Line: 51)

StartLoading Error (async: 871):    System.ExecutionEngineException: Couldn't create thread
  at (wrapper managed-to-native) object:__icall_wrapper_mono_delegate_begin_invoke (object,intptr)
  at (wrapper delegate-begin-invoke) System.Threading.WaitCallback:begin_invoke_IAsyncResult__this___object_AsyncCallback_object (object,System.AsyncCallback,object)
  at System.Threading.ThreadPool.QueueUserWorkItem (System.Threading.WaitCallback callBack, System.Object state) [0x00000] in <filename unknown>:0 
  at System.Threading.ThreadPool.QueueUserWorkItem (System.Threading.WaitCallback callBack) [0x00000] in <filename unknown>:0 
  at ArcenAsyncFile.StartLoad (ArcenAsyncDataType ReadDataType, System.String Filename) [0x00000] in <filename unknown>:0 
  at GameImage.StartLoading () [0x00000] in <filename unknown>:0 
 
(Filename: C:/buildslave/unity/build/artifacts/generated/common/runtime/DebugBindings.gen.cpp Line: 51)

DynamicHeapAllocator allocation probe 1 failed - Could not get memory for large allocation 8294416.
DynamicHeapAllocator allocation probe 2 failed - Could not get memory for large allocation 8294416.
DynamicHeapAllocator allocation probe 3 failed - Could not get memory for large allocation 8294416.
DynamicHeapAllocator allocation probe 4 failed - Could not get memory for large allocation 8294416.
DynamicHeapAllocator out of memory - Could not get memory for large allocation 8294416!
Could not allocate memory: System out of memory!
Trying to allocate: 8294416B with 16 alignment. MemoryLabel: NewDelete
Allocation happend at: Line:803 in 
Memory overview

[ ALLOC_DEFAULT ] used: 322467922B | peak: 0B | reserved: 333382906B 
[ ALLOC_TEMP_JOB ] used: 397372B | peak: 0B | reserved: 2097152B 
[ ALLOC_GFX ] used: 1387476368B | peak: 0B | reserved: 1397784864B 
[ ALLOC_CACHEOBJECTS ] used: 427168B | peak: 0B | reserved: 10485760B 
[ ALLOC_TYPETREE ] used: 0B | peak: 0B | reserved: 0B 
[ ALLOC_PROFILER ] used: 0B | peak: 0B | reserved: 0B 
[ ALLOC_TEMP_THREAD ] used: 32768B | peak: 0B | reserved: 3112960B 
Could not allocate memory: System out of memory!
Trying to allocate: 8294416B with 16 alignment. MemoryLabel: NewDelete
Allocation happend at: Line:803 in 
Memory overview

[ ALLOC_DEFAULT ] used: 322467922B | peak: 0B | reserved: 333382906B 
[ ALLOC_TEMP_JOB ] used: 397372B | peak: 0B | reserved: 2097152B 
[ ALLOC_GFX ] used: 1387476368B | peak: 0B | reserved: 1397784864B 
[ ALLOC_CACHEOBJECTS ] used: 427168B | peak: 0B | reserved: 10485760B 
[ ALLOC_TYPETREE ] used: 0B | peak: 0B | reserved: 0B 
[ ALLOC_PROFILER ] used: 0B | peak: 0B | reserved: 0B 
[ ALLOC_TEMP_THREAD ] used: 32768B | peak: 0B | reserved: 3112960B 

 
(Filename:  Line: 1045)

Crash!!!
SymInit: Symbol-SearchPath: '.;C:\Steam\steamapps\common\Starward Rogue;C:\Steam\steamapps\common\Starward Rogue;C:\WINDOWS;C:\WINDOWS\system32;SRV*C:\websymbols*http://msdl.microsoft.com/download/symbols;', symOptions: 530, UserName: 'gmivb'
OS-Version: 10.0.17134 () 0x100-0x1
C:\Steam\steamapps\common\Starward Rogue\StarwardRogue.exe:StarwardRogue.exe (00070000), size: 19247104 (result: 0), SymType: '-exported-', PDB: 'C:\Steam\steamapps\common\Starward Rogue\StarwardRogue.exe', fileVersion: 2017.1.0.11279
C:\WINDOWS\SYSTEM32\ntdll.dll:ntdll.dll (77AA0000), size: 1638400 (result: 0), SymType: '-exported-', PDB: 'C:\WINDOWS\SYSTEM32\ntdll.dll', fileVersion: 10.0.17134.1
C:\WINDOWS\System32\KERNEL32.DLL:KERNEL32.DLL (754C0000), size: 917504 (result: 0), SymType: '-exported-', PDB: 'C:\WINDOWS\System32\KERNEL32.DLL', fileVersion: 10.0.17134.1
C:\WINDOWS\System32\KERNELBASE.dll:KERNELBASE.dll (75D60000), size: 1978368 (result: 0), SymType: '-exported-', PDB: 'C:\WINDOWS\System32\KERNELBASE.dll', fileVersion: 10.0.17134.1
C:\WINDOWS\System32\USER32.dll:USER32.dll (75B20000), size: 1626112 (result: 0), SymType: '-exported-', PDB: 'C:\WINDOWS\System32\USER32.dll', fileVersion: 10.0.17134.1
C:\WINDOWS\System32\win32u.dll:win32u.dll (74520000), size: 94208 (result: 0), SymType: '-exported-', PDB: 'C:\WINDOWS\System32\win32u.dll', fileVersion: 10.0.17134.1
C:\WINDOWS\SYSTEM32\HID.DLL:HID.DLL (6DEB0000), size: 40960 (result: 0), SymType: '-exported-', PDB: 'C:\WINDOWS\SYSTEM32\HID.DLL', fileVersion: 10.0.17134.1
C:\WINDOWS\System32\GDI32.dll:GDI32.dll (74D90000), size: 139264 (result: 0), SymType: '-exported-', PDB: 'C:\WINDOWS\System32\GDI32.dll', fileVersion: 10.0.17134.1
C:\WINDOWS\System32\msvcrt.dll:msvcrt.dll (755A0000), size: 782336 (result: 0), SymType: '-exported-', PDB: 'C:\WINDOWS\System32\msvcrt.dll', fileVersion: 7.0.17134.1
C:\WINDOWS\System32\gdi32full.dll:gdi32full.dll (74C10000), size: 1458176 (result: 0), SymType: '-exported-', PDB: 'C:\WINDOWS\System32\gdi32full.dll', fileVersion: 10.0.17134.81
C:\WINDOWS\System32\msvcp_win.dll:msvcp_win.dll (74EF0000), size: 512000 (result: 0), SymType: '-exported-', PDB: 'C:\WINDOWS\System32\msvcp_win.dll', fileVersion: 10.0.17134.1
C:\WINDOWS\System32\ucrtbase.dll:ucrtbase.dll (74F70000), size: 1171456 (result: 0), SymType: '-exported-', PDB: 'C:\WINDOWS\System32\ucrtbase.dll', fileVersion: 10.0.17134.1
C:\WINDOWS\System32\ole32.dll:ole32.dll (74550000), size: 1032192 (result: 0), SymType: '-exported-', PDB: 'C:\WINDOWS\System32\ole32.dll', fileVersion: 10.0.17134.1
C:\WINDOWS\System32\combase.dll:combase.dll (774B0000), size: 2473984 (result: 0), SymType: '-exported-', PDB: 'C:\WINDOWS\System32\combase.dll', fileVersion: 10.0.17134.1
C:\WINDOWS\System32\RPCRT4.dll:RPCRT4.dll (75FE0000), size: 786432 (result: 0), SymType: '-exported-', PDB: 'C:\WINDOWS\System32\RPCRT4.dll', fileVersion: 10.0.17134.48
C:\WINDOWS\SYSTEM32\VERSION.dll:VERSION.dll (74260000), size: 32768 (result: 0), SymType: '-exported-', PDB: 'C:\WINDOWS\SYSTEM32\VERSION.dll', fileVersion: 10.0.17134.1
C:\WINDOWS\System32\SspiCli.dll:SspiCli.dll (74360000), size: 131072 (result: 0), SymType: '-exported-', PDB: 'C:\WINDOWS\System32\SspiCli.dll', fileVersion: 10.0.17134.1
C:\WINDOWS\System32\CRYPTBASE.dll:CRYPTBASE.dll (74350000), size: 40960 (result: 0), SymType: '-exported-', PDB: 'C:\WINDOWS\System32\CRYPTBASE.dll', fileVersion: 10.0.17134.1
C:\WINDOWS\System32\bcryptPrimitives.dll:bcryptPrimitives.dll (77880000), size: 360448 (result: 0), SymType: '-exported-', PDB: 'C:\WINDOWS\System32\bcryptPrimitives.dll', fileVersion: 10.0.17134.1
C:\WINDOWS\System32\sechost.dll:sechost.dll (75A80000), size: 278528 (result: 0), SymType: '-exported-', PDB: 'C:\WINDOWS\System32\sechost.dll', fileVersion: 10.0.17134.1
C:\WINDOWS\System32\SHLWAPI.dll:SHLWAPI.dll (74EA0000), size: 282624 (result: 0), SymType: '-exported-', PDB: 'C:\WINDOWS\System32\SHLWAPI.dll', fileVersion: 10.0.17134.1
C:\WINDOWS\System32\SETUPAPI.dll:SETUPAPI.dll (75090000), size: 4370432 (result: 0), SymType: '-exported-', PDB: 'C:\WINDOWS\System32\SETUPAPI.dll', fileVersion: 10.0.17134.1
C:\WINDOWS\System32\cfgmgr32.dll:cfgmgr32.dll (77470000), size: 233472 (result: 0), SymType: '-exported-', PDB: 'C:\WINDOWS\System32\cfgmgr32.dll', fileVersion: 10.0.17134.1
C:\WINDOWS\System32\ADVAPI32.dll:ADVAPI32.dll (77710000), size: 491520 (result: 0), SymType: '-exported-', PDB: 'C:\WINDOWS\System32\ADVAPI32.dll', fileVersion: 10.0.17134.1
C:\WINDOWS\System32\SHELL32.dll:SHELL32.dll (760A0000), size: 20226048 (result: 0), SymType: '-nosymbols-', PDB: 'C:\WINDOWS\System32\SHELL32.dll', fileVersion: 10.0.17134.81
C:\WINDOWS\System32\shcore.dll:shcore.dll (74E10000), size: 561152 (result: 0), SymType: '-exported-', PDB: 'C:\WINDOWS\System32\shcore.dll', fileVersion: 10.0.17134.1
C:\WINDOWS\System32\windows.storage.dll:windows.storage.dll (74650000), size: 6004736 (result: 0), SymType: '-nosymbols-', PDB: 'C:\WINDOWS\System32\windows.storage.dll', fileVersion: 10.0.17134.81
C:\WINDOWS\System32\kernel.appcore.dll:kernel.appcore.dll (779A0000), size: 61440 (result: 0), SymType: '-exported-', PDB: 'C:\WINDOWS\System32\kernel.appcore.dll', fileVersion: 10.0.17134.1
C:\WINDOWS\System32\profapi.dll:profapi.dll (75B00000), size: 98304 (result: 0), SymType: '-nosymbols-', PDB: 'C:\WINDOWS\System32\profapi.dll', fileVersion: 10.0.17134.1
C:\WINDOWS\System32\powrprof.dll:powrprof.dll (74DC0000), size: 282624 (result: 0), SymType: '-exported-', PDB: 'C:\WINDOWS\System32\powrprof.dll', fileVersion: 10.0.17134.1
C:\WINDOWS\System32\FLTLIB.DLL:FLTLIB.DLL (778E0000), size: 32768 (result: 0), SymType: '-exported-', PDB: 'C:\WINDOWS\System32\FLTLIB.DLL', fileVersion: 10.0.17134.1
C:\WINDOWS\System32\WS2_32.dll:WS2_32.dll (773F0000), size: 421888 (result: 0), SymType: '-exported-', PDB: 'C:\WINDOWS\System32\WS2_32.dll', fileVersion: 10.0.17134.1
C:\WINDOWS\System32\OLEAUT32.dll:OLEAUT32.dll (75CC0000), size: 614400 (result: 0), SymType: '-exported-', PDB: 'C:\WINDOWS\System32\OLEAUT32.dll', fileVersion: 10.0.17134.48
C:\WINDOWS\SYSTEM32\OPENGL32.dll:OPENGL32.dll (6AD00000), size: 888832 (result: 0), SymType: '-exported-', PDB: 'C:\WINDOWS\SYSTEM32\OPENGL32.dll', fileVersion: 10.0.17134.1
C:\WINDOWS\System32\IMM32.dll:IMM32.dll (75AD0000), size: 155648 (result: 0), SymType: '-exported-', PDB: 'C:\WINDOWS\System32\IMM32.dll', fileVersion: 10.0.17134.1
C:\WINDOWS\SYSTEM32\WINMM.dll:WINMM.dll (6C870000), size: 147456 (result: 0), SymType: '-exported-', PDB: 'C:\WINDOWS\SYSTEM32\WINMM.dll', fileVersion: 10.0.17134.1
C:\WINDOWS\SYSTEM32\GLU32.dll:GLU32.dll (6A050000), size: 258048 (result: 0), SymType: '-exported-', PDB: 'C:\WINDOWS\SYSTEM32\GLU32.dll', fileVersion: 10.0.17134.1
C:\WINDOWS\SYSTEM32\DNSAPI.dll:DNSAPI.dll (70AC0000), size: 581632 (result: 0), SymType: '-nosymbols-', PDB: 'C:\WINDOWS\SYSTEM32\DNSAPI.dll', fileVersion: 10.0.17134.1
C:\WINDOWS\SYSTEM32\IPHLPAPI.DLL:IPHLPAPI.DLL (70B50000), size: 196608 (result: 0), SymType: '-nosymbols-', PDB: 'C:\WINDOWS\SYSTEM32\IPHLPAPI.DLL', fileVersion: 10.0.17134.1
C:\WINDOWS\System32\NSI.dll:NSI.dll (74D80000), size: 28672 (result: 0), SymType: '-exported-', PDB: 'C:\WINDOWS\System32\NSI.dll', fileVersion: 10.0.17134.1
C:\WINDOWS\SYSTEM32\WINHTTP.dll:WINHTTP.dll (6E4A0000), size: 720896 (result: 0), SymType: '-exported-', PDB: 'C:\WINDOWS\SYSTEM32\WINHTTP.dll', fileVersion: 10.0.17134.1
C:\WINDOWS\SYSTEM32\WINMMBASE.dll:WINMMBASE.dll (6ACD0000), size: 143360 (result: 0), SymType: '-exported-', PDB: 'C:\WINDOWS\SYSTEM32\WINMMBASE.dll', fileVersion: 10.0.17134.1
C:\Steam\gameoverlayrenderer.dll:gameoverlayrenderer.dll (61140000), size: 1327104 (result: 0), SymType: '-nosymbols-', PDB: 'C:\Steam\gameoverlayrenderer.dll', fileVersion: 4.54.16.53
C:\WINDOWS\System32\PSAPI.DLL:PSAPI.DLL (74540000), size: 24576 (result: 0), SymType: '-nosymbols-', PDB: 'C:\WINDOWS\System32\PSAPI.DLL', fileVersion: 10.0.17134.1
C:\WINDOWS\system32\uxtheme.dll:uxtheme.dll (6C600000), size: 507904 (result: 0), SymType: '-nosymbols-', PDB: 'C:\WINDOWS\system32\uxtheme.dll', fileVersion: 10.0.17134.1
C:\Steam\steamapps\common\Starward Rogue\StarwardRogue_Data\Mono\EmbedRuntime\mono.dll:mono.dll (10000000), size: 2289664 (result: 0), SymType: '-nosymbols-', PDB: 'C:\Steam\steamapps\common\Starward Rogue\StarwardRogue_Data\Mono\EmbedRuntime\mono.dll', fileVersion: 1.0.0.1
C:\WINDOWS\SYSTEM32\MSWSOCK.dll:MSWSOCK.dll (70A10000), size: 352256 (result: 0), SymType: '-nosymbols-', PDB: 'C:\WINDOWS\SYSTEM32\MSWSOCK.dll', fileVersion: 10.0.17134.1
C:\WINDOWS\System32\MSCTF.dll:MSCTF.dll (75930000), size: 1327104 (result: 0), SymType: '-nosymbols-', PDB: 'C:\WINDOWS\System32\MSCTF.dll', fileVersion: 10.0.17134.1
C:\WINDOWS\system32\dwmapi.dll:dwmapi.dll (6C8E0000), size: 143360 (result: 0), SymType: '-nosymbols-', PDB: 'C:\WINDOWS\system32\dwmapi.dll', fileVersion: 10.0.17134.1
C:\WINDOWS\SYSTEM32\d3d9.dll:d3d9.dll (63D50000), size: 1503232 (result: 0), SymType: '-nosymbols-', PDB: 'C:\WINDOWS\SYSTEM32\d3d9.dll', fileVersion: 10.0.17134.81
C:\WINDOWS\System32\DriverStore\FileRepository\igdlh64.inf_amd64_bc75cebf5edbbc50\igdumdim32.dll:igdumdim32.dll (60F90000), size: 1716224 (result: 0), SymType: '-nosymbols-', PDB: 'C:\WINDOWS\System32\DriverStore\FileRepository\igdlh64.inf_amd64_bc75cebf5edbbc50\igdumdim32.dll', fileVersion: 23.20.16.4973
C:\WINDOWS\System32\DriverStore\FileRepository\igdlh64.inf_amd64_bc75cebf5edbbc50\igd9dxva32.dll:igd9dxva32.dll (5CE90000), size: 48836608 (result: 0), SymType: '-nosymbols-', PDB: 'C:\WINDOWS\System32\DriverStore\FileRepository\igdlh64.inf_amd64_bc75cebf5edbbc50\igd9dxva32.dll', fileVersion: 23.20.16.4973
C:\WINDOWS\System32\DriverStore\FileRepository\igdlh64.inf_amd64_bc75cebf5edbbc50\igc32.dll:igc32.dll (5B160000), size: 27205632 (result: 0), SymType: '-nosymbols-', PDB: 'C:\WINDOWS\System32\DriverStore\FileRepository\igdlh64.inf_amd64_bc75cebf5edbbc50\igc32.dll', fileVersion: 23.20.16.4973
C:\WINDOWS\System32\clbcatq.dll:clbcatq.dll (11250000), size: 536576 (result: 0), SymType: '-nosymbols-', PDB: 'C:\WINDOWS\System32\clbcatq.dll', fileVersion: 2001.12.10941.16384
C:\WINDOWS\System32\MMDevApi.dll:MMDevApi.dll (628C0000), size: 376832 (result: 0), SymType: '-nosymbols-', PDB: 'C:\WINDOWS\System32\MMDevApi.dll', fileVersion: 10.0.17134.1
C:\WINDOWS\System32\DEVOBJ.dll:DEVOBJ.dll (709E0000), size: 139264 (result: 0), SymType: '-nosymbols-', PDB: 'C:\WINDOWS\System32\DEVOBJ.dll', fileVersion: 10.0.17134.1
C:\WINDOWS\System32\PROPSYS.dll:PROPSYS.dll (6F370000), size: 1572864 (result: 0), SymType: '-nosymbols-', PDB: 'C:\WINDOWS\System32\PROPSYS.dll', fileVersion: 7.0.17134.1
C:\WINDOWS\SYSTEM32\wdmaud.drv:wdmaud.drv (63380000), size: 241664 (result: 0), SymType: '-nosymbols-', PDB: 'C:\WINDOWS\SYSTEM32\wdmaud.drv', fileVersion: 10.0.17134.1
C:\WINDOWS\SYSTEM32\AVRT.dll:AVRT.dll (62A20000), size: 32768 (result: 0), SymType: '-nosymbols-', PDB: 'C:\WINDOWS\SYSTEM32\AVRT.dll', fileVersion: 10.0.17134.1
C:\WINDOWS\SYSTEM32\ksuser.dll:ksuser.dll (63520000), size: 28672 (result: 0), SymType: '-nosymbols-', PDB: 'C:\WINDOWS\SYSTEM32\ksuser.dll', fileVersion: 10.0.17134.1
C:\WINDOWS\SYSTEM32\AUDIOSES.DLL:AUDIOSES.DLL (62920000), size: 1028096 (result: 0), SymType: '-nosymbols-', PDB: 'C:\WINDOWS\SYSTEM32\AUDIOSES.DLL', fileVersion: 10.0.17134.81
C:\WINDOWS\SYSTEM32\wintypes.dll:wintypes.dll (6EBA0000), size: 876544 (result: 0), SymType: '-nosymbols-', PDB: 'C:\WINDOWS\SYSTEM32\wintypes.dll', fileVersion: 10.0.17134.1
C:\WINDOWS\SYSTEM32\msacm32.drv:msacm32.drv (63370000), size: 40960 (result: 0), SymType: '-nosymbols-', PDB: 'C:\WINDOWS\SYSTEM32\msacm32.drv', fileVersion: 10.0.17134.1
C:\WINDOWS\SYSTEM32\MSACM32.dll:MSACM32.dll (63350000), size: 102400 (result: 0), SymType: '-nosymbols-', PDB: 'C:\WINDOWS\SYSTEM32\MSACM32.dll', fileVersion: 10.0.17134.1
C:\WINDOWS\SYSTEM32\midimap.dll:midimap.dll (63340000), size: 32768 (result: 0), SymType: '-nosymbols-', PDB: 'C:\WINDOWS\SYSTEM32\midimap.dll', fileVersion: 10.0.17134.1
C:\WINDOWS\SYSTEM32\xinput1_3.dll:xinput1_3.dll (12300000), size: 90112 (result: 0), SymType: '-nosymbols-', PDB: 'C:\WINDOWS\SYSTEM32\xinput1_3.dll', fileVersion: 9.18.944.0
C:\WINDOWS\SYSTEM32\TextInputFramework.dll:TextInputFramework.dll (61690000), size: 516096 (result: 0), SymType: '-nosymbols-', PDB: 'C:\WINDOWS\SYSTEM32\TextInputFramework.dll', fileVersion: 10.0.17134.1
C:\WINDOWS\SYSTEM32\CoreUIComponents.dll:CoreUIComponents.dll (69D50000), size: 2478080 (result: 0), SymType: '-nosymbols-', PDB: 'C:\WINDOWS\SYSTEM32\CoreUIComponents.dll', fileVersion: 10.0.17134.81
C:\WINDOWS\SYSTEM32\CoreMessaging.dll:CoreMessaging.dll (6C570000), size: 569344 (result: 0), SymType: '-nosymbols-', PDB: 'C:\WINDOWS\SYSTEM32\CoreMessaging.dll', fileVersion: 10.0.17134.81
C:\WINDOWS\SYSTEM32\ntmarta.dll:ntmarta.dll (6DFD0000), size: 167936 (result: 0), SymType: '-nosymbols-', PDB: 'C:\WINDOWS\SYSTEM32\ntmarta.dll', fileVersion: 10.0.17134.1
C:\WINDOWS\system32\wbem\wbemprox.dll:wbemprox.dll (6E940000), size: 53248 (result: 0), SymType: '-nosymbols-', PDB: 'C:\WINDOWS\system32\wbem\wbemprox.dll', fileVersion: 10.0.17134.1
C:\WINDOWS\SYSTEM32\wbemcomn.dll:wbemcomn.dll (6E950000), size: 438272 (result: 0), SymType: '-nosymbols-', PDB: 'C:\WINDOWS\SYSTEM32\wbemcomn.dll', fileVersion: 10.0.17134.1
C:\WINDOWS\SYSTEM32\bcrypt.dll:bcrypt.dll (70BD0000), size: 102400 (result: 0), SymType: '-nosymbols-', PDB: 'C:\WINDOWS\SYSTEM32\bcrypt.dll', fileVersion: 10.0.17134.1
C:\WINDOWS\system32\wbem\wbemsvc.dll:wbemsvc.dll (6E930000), size: 65536 (result: 0), SymType: '-nosymbols-', PDB: 'C:\WINDOWS\system32\wbem\wbemsvc.dll', fileVersion: 10.0.17134.1
C:\WINDOWS\system32\wbem\fastprox.dll:fastprox.dll (6E860000), size: 798720 (result: 0), SymType: '-nosymbols-', PDB: 'C:\WINDOWS\system32\wbem\fastprox.dll', fileVersion: 10.0.17134.1
C:\WINDOWS\SYSTEM32\CRYPTSP.dll:CRYPTSP.dll (70BB0000), size: 77824 (result: 0), SymType: '-nosymbols-', PDB: 'C:\WINDOWS\SYSTEM32\CRYPTSP.dll', fileVersion: 10.0.17134.1
C:\WINDOWS\system32\rsaenh.dll:rsaenh.dll (70B80000), size: 192512 (result: 0), SymType: '-nosymbols-', PDB: 'C:\WINDOWS\system32\rsaenh.dll', fileVersion: 10.0.17134.1
C:\WINDOWS\SYSTEM32\dhcpcsvc6.DLL:dhcpcsvc6.DLL (70AA0000), size: 77824 (result: 0), SymType: '-nosymbols-', PDB: 'C:\WINDOWS\SYSTEM32\dhcpcsvc6.DLL', fileVersion: 10.0.17134.1
C:\WINDOWS\SYSTEM32\dhcpcsvc.DLL:dhcpcsvc.DLL (70A80000), size: 81920 (result: 0), SymType: '-nosymbols-', PDB: 'C:\WINDOWS\SYSTEM32\dhcpcsvc.DLL', fileVersion: 10.0.17134.1
C:\Steam\steamapps\common\Starward Rogue\StarwardRogue_Data\Plugins\XInputInterface32.dll:XInputInterface32.dll (61710000), size: 77824 (result: 0), SymType: '-nosymbols-', PDB: 'C:\Steam\steamapps\common\Starward Rogue\StarwardRogue_Data\Plugins\XInputInterface32.dll'
C:\Windows\System32\rasadhlp.dll:rasadhlp.dll (6DDE0000), size: 32768 (result: 0), SymType: '-nosymbols-', PDB: 'C:\Windows\System32\rasadhlp.dll', fileVersion: 10.0.17134.1
C:\WINDOWS\System32\fwpuclnt.dll:fwpuclnt.dll (6DC60000), size: 323584 (result: 0), SymType: '-nosymbols-', PDB: 'C:\WINDOWS\System32\fwpuclnt.dll', fileVersion: 10.0.17134.1
C:\WINDOWS\System32\WINTRUST.dll:WINTRUST.dll (778F0000), size: 290816 (result: 0), SymType: '-nosymbols-', PDB: 'C:\WINDOWS\System32\WINTRUST.dll', fileVersion: 10.0.17134.81
C:\WINDOWS\System32\MSASN1.dll:MSASN1.dll (77460000), size: 57344 (result: 0), SymType: '-nosymbols-', PDB: 'C:\WINDOWS\System32\MSASN1.dll', fileVersion: 10.0.17134.1
C:\WINDOWS\System32\CRYPT32.dll:CRYPT32.dll (74380000), size: 1662976 (result: 0), SymType: '-nosymbols-', PDB: 'C:\WINDOWS\System32\CRYPT32.dll', fileVersion: 10.0.17134.1
C:\Steam\steamapps\common\Starward Rogue\StarwardRogue_Data\Plugins\CSteamworks.dll:CSteamworks.dll (60F60000), size: 135168 (result: 0), SymType: '-nosymbols-', PDB: 'C:\Steam\steamapps\common\Starward Rogue\StarwardRogue_Data\Plugins\CSteamworks.dll', fileVersion: 1.7.0.0
C:\Steam\steamapps\common\Starward Rogue\steam_api.dll:steam_api.dll (60F40000), size: 122880 (result: 0), SymType: '-nosymbols-', PDB: 'C:\Steam\steamapps\common\Starward Rogue\steam_api.dll', fileVersion: 2.19.34.93
C:\Steam\steamclient.dll:steamclient.dll (61880000), size: 12296192 (result: 0), SymType: '-nosymbols-', PDB: 'C:\Steam\steamclient.dll', fileVersion: 4.54.16.53
C:\WINDOWS\System32\imagehlp.dll:imagehlp.dll (75660000), size: 102400 (result: 0), SymType: '-nosymbols-', PDB: 'C:\WINDOWS\System32\imagehlp.dll', fileVersion: 10.0.17134.1
C:\Steam\vstdlib_s.dll:vstdlib_s.dll (6C510000), size: 380928 (result: 0), SymType: '-nosymbols-', PDB: 'C:\Steam\vstdlib_s.dll', fileVersion: 4.54.16.53
C:\Steam\tier0_s.dll:tier0_s.dll (6B1A0000), size: 626688 (result: 0), SymType: '-nosymbols-', PDB: 'C:\Steam\tier0_s.dll', fileVersion: 4.54.16.53
C:\WINDOWS\SYSTEM32\Secur32.dll:Secur32.dll (6E230000), size: 40960 (result: 0), SymType: '-nosymbols-', PDB: 'C:\WINDOWS\SYSTEM32\Secur32.dll', fileVersion: 10.0.17134.1
C:\Steam\steam.dll:steam.dll (5FE10000), size: 794624 (result: 0), SymType: '-nosymbols-', PDB: 'C:\Steam\steam.dll'
C:\Steam\Steam2.dll:Steam2.dll (5AE90000), size: 2887680 (result: 0), SymType: '-nosymbols-', PDB: 'C:\Steam\Steam2.dll', fileVersion: 2.0.2117.156
C:\WINDOWS\system32\napinsp.dll:napinsp.dll (6CB50000), size: 69632 (result: 0), SymType: '-nosymbols-', PDB: 'C:\WINDOWS\system32\napinsp.dll', fileVersion: 10.0.17134.1
C:\WINDOWS\system32\pnrpnsp.dll:pnrpnsp.dll (6CAE0000), size: 90112 (result: 0), SymType: '-nosymbols-', PDB: 'C:\WINDOWS\system32\pnrpnsp.dll', fileVersion: 10.0.17134.1
C:\WINDOWS\system32\NLAapi.dll:NLAapi.dll (6CAC0000), size: 77824 (result: 0), SymType: '-nosymbols-', PDB: 'C:\WINDOWS\system32\NLAapi.dll', fileVersion: 10.0.17134.1
C:\WINDOWS\System32\winrnr.dll:winrnr.dll (6CB40000), size: 49152 (result: 0), SymType: '-nosymbols-', PDB: 'C:\WINDOWS\System32\winrnr.dll', fileVersion: 10.0.17134.1
C:\Steam\DbgHelp.dll:DbgHelp.dll (5AD70000), size: 1134592 (result: 0), SymType: '-nosymbols-', PDB: 'C:\Steam\DbgHelp.dll', fileVersion: 6.7.5.0
C:\Steam\CSERHelper.dll:CSERHelper.dll (60F10000), size: 135168 (result: 0), SymType: '-nosymbols-', PDB: 'C:\Steam\CSERHelper.dll', fileVersion: 4.50.0.0
C:\Windows\System32\Windows.UI.dll:Windows.UI.dll (5FD30000), size: 888832 (result: 0), SymType: '-nosymbols-', PDB: 'C:\Windows\System32\Windows.UI.dll', fileVersion: 10.0.17134.1
C:\Windows\System32\InputHost.dll:InputHost.dll (69FB0000), size: 368640 (result: 0), SymType: '-nosymbols-', PDB: 'C:\Windows\System32\InputHost.dll'

========== OUTPUTING STACK TRACE ==================

  ERROR: SymGetSymFromAddr64, GetLastError: 'Попытка обращения к неверному адресу.' (Address: 00EAB1CF)
0x00EAB1CF (StarwardRogue) 
  ERROR: SymGetSymFromAddr64, GetLastError: 'Попытка обращения к неверному адресу.' (Address: 000ECD2B)
0x000ECD2B (StarwardRogue) 
  ERROR: SymGetSymFromAddr64, GetLastError: 'Попытка обращения к неверному адресу.' (Address: 000ECD8B)
0x000ECD8B (StarwardRogue) 
  ERROR: SymGetSymFromAddr64, GetLastError: 'Попытка обращения к неверному адресу.' (Address: 0011DA1E)
0x0011DA1E (StarwardRogue) 
  ERROR: SymGetSymFromAddr64, GetLastError: 'Попытка обращения к неверному адресу.' (Address: 0092F3A8)
0x0092F3A8 (StarwardRogue) 
  ERROR: SymGetSymFromAddr64, GetLastError: 'Попытка обращения к неверному адресу.' (Address: 00EB241D)
0x00EB241D (StarwardRogue) 
0x754D8484 (KERNEL32) BaseThreadInitThunk
0x77B02EC0 (ntdll) RtlValidSecurityDescriptor
0x77B02E90 (ntdll) RtlValidSecurityDescriptor

========== END OF STACKTRACE ===========

**** Crash! ****
output_log-3.txt (66,863 bytes)
error-3.log (43,919 bytes)

x4000Bughunter

Jun 11, 2018 11:16 am

administrator   ~0047560

Is it always doing this at the switch between floors, and not at any other time? Is it when a floor is fresh, or literally right during the transition?

patsancheg

Jun 13, 2018 6:09 am

reporter   ~0047563

It looks like it crashes at the moment when new floor starts loading. It also crashed once or twice when I entered a new room.
If I quit to desktop every 2 floors and restart the game then there are no crashes.

x4000Bughunter

Jun 20, 2018 11:52 am

administrator   ~0047566

Hmm -- I'm really not sure what to make of that. You have plenty of RAM free, it sounds like. But it sounds like it's choking on the amount of textures loaded or something. Are you able to look at task manager after a few floors down and see what the game is using.

Also, if you hit F3 in the game, it will show you how much "managed" memory it's using. That will count up a lot and then drop back down every 30 seconds at the most. How high does that go?

patsancheg

Jun 21, 2018 12:54 am

reporter   ~0047567

I started a new run, managed memory max = 135,000,000.
Died on second floor, clicked 'start new run', managed memory max = 170,000,000.
Floor 4 (from task manager): CPU 49.6%; RAM 45% (1024.5 Mb); GPU 87.5%; GPU RAM 0.2/3.9 Gb; managed memory max = 165,000,000.
Floor 5 (from task manager): CPU 48.4%; RAM 1106.7 Mb; GPU 87.4%; GPU RAM 0.3/3.9 Gb; managed memory max = 174,000,000.
Floor 5 cleared: managed memory max = 192,000,000.

Floor 6 - crash upon entering a regular room (cleared half of the floor).
files attached

output_log-4.txt (33,395 bytes)
Initialize engine version: 2017.1.0p4 (892c0f8d8f8a)
GfxDevice: creating device client; threaded=1
Direct3D:
    Version:  Direct3D 9.0c [igdumdim32.dll 23.20.16.4973]
    Renderer: Intel(R) HD Graphics 630
    Vendor:   Intel
    VRAM:     2111 MB (via DXGI)
    Caps:     Shader=30 DepthRT=1 NativeDepth=1 NativeShadow=1 DF16=1 INTZ=1 NULL=1 RESZ=1 SlowINTZ=0 ATOC=1 BC4=1 BC5=1
Begin MonoManager ReloadAssembly
Platform assembly: C:\Steam\steamapps\common\Starward Rogue\StarwardRogue_Data\Managed\UnityEngine.dll (this message is harmless)
Loading C:\Steam\steamapps\common\Starward Rogue\StarwardRogue_Data\Managed\UnityEngine.dll into Unity Child Domain
Platform assembly: C:\Steam\steamapps\common\Starward Rogue\StarwardRogue_Data\Managed\I18N.dll (this message is harmless)
Platform assembly: C:\Steam\steamapps\common\Starward Rogue\StarwardRogue_Data\Managed\I18N.Other.dll (this message is harmless)
Platform assembly: C:\Steam\steamapps\common\Starward Rogue\StarwardRogue_Data\Managed\Assembly-CSharp.dll (this message is harmless)
Loading C:\Steam\steamapps\common\Starward Rogue\StarwardRogue_Data\Managed\Assembly-CSharp.dll into Unity Child Domain
Platform assembly: C:\Steam\steamapps\common\Starward Rogue\StarwardRogue_Data\Managed\UnityEngine.UI.dll (this message is harmless)
Loading C:\Steam\steamapps\common\Starward Rogue\StarwardRogue_Data\Managed\UnityEngine.UI.dll into Unity Child Domain
Platform assembly: C:\Steam\steamapps\common\Starward Rogue\StarwardRogue_Data\Managed\UnityEngine.Networking.dll (this message is harmless)
Loading C:\Steam\steamapps\common\Starward Rogue\StarwardRogue_Data\Managed\UnityEngine.Networking.dll into Unity Child Domain
Platform assembly: C:\Steam\steamapps\common\Starward Rogue\StarwardRogue_Data\Managed\UnityEngine.Timeline.dll (this message is harmless)
Loading C:\Steam\steamapps\common\Starward Rogue\StarwardRogue_Data\Managed\UnityEngine.Timeline.dll into Unity Child Domain
Platform assembly: C:\Steam\steamapps\common\Starward Rogue\StarwardRogue_Data\Managed\Ionic.Zip.Reduced.dll (this message is harmless)
Loading C:\Steam\steamapps\common\Starward Rogue\StarwardRogue_Data\Managed\Ionic.Zip.Reduced.dll into Unity Child Domain
Platform assembly: C:\Steam\steamapps\common\Starward Rogue\StarwardRogue_Data\Managed\ExcelLibrary.dll (this message is harmless)
Loading C:\Steam\steamapps\common\Starward Rogue\StarwardRogue_Data\Managed\ExcelLibrary.dll into Unity Child Domain
Platform assembly: C:\Steam\steamapps\common\Starward Rogue\StarwardRogue_Data\Managed\I18N.CJK.dll (this message is harmless)
Loading C:\Steam\steamapps\common\Starward Rogue\StarwardRogue_Data\Managed\I18N.CJK.dll into Unity Child Domain
Platform assembly: C:\Steam\steamapps\common\Starward Rogue\StarwardRogue_Data\Managed\I18N.dll (this message is harmless)
Loading C:\Steam\steamapps\common\Starward Rogue\StarwardRogue_Data\Managed\I18N.dll into Unity Child Domain
Platform assembly: C:\Steam\steamapps\common\Starward Rogue\StarwardRogue_Data\Managed\I18N.MidEast.dll (this message is harmless)
Loading C:\Steam\steamapps\common\Starward Rogue\StarwardRogue_Data\Managed\I18N.MidEast.dll into Unity Child Domain
Platform assembly: C:\Steam\steamapps\common\Starward Rogue\StarwardRogue_Data\Managed\I18N.Other.dll (this message is harmless)
Loading C:\Steam\steamapps\common\Starward Rogue\StarwardRogue_Data\Managed\I18N.Other.dll into Unity Child Domain
Platform assembly: C:\Steam\steamapps\common\Starward Rogue\StarwardRogue_Data\Managed\I18N.Rare.dll (this message is harmless)
Loading C:\Steam\steamapps\common\Starward Rogue\StarwardRogue_Data\Managed\I18N.Rare.dll into Unity Child Domain
Platform assembly: C:\Steam\steamapps\common\Starward Rogue\StarwardRogue_Data\Managed\I18N.West.dll (this message is harmless)
Loading C:\Steam\steamapps\common\Starward Rogue\StarwardRogue_Data\Managed\I18N.West.dll into Unity Child Domain
Platform assembly: C:\Steam\steamapps\common\Starward Rogue\StarwardRogue_Data\Managed\System.Drawing.dll (this message is harmless)
Loading C:\Steam\steamapps\common\Starward Rogue\StarwardRogue_Data\Managed\System.Drawing.dll into Unity Child Domain
Platform assembly: C:\Steam\steamapps\common\Starward Rogue\StarwardRogue_Data\Managed\Steamworks.NET.dll (this message is harmless)
Loading C:\Steam\steamapps\common\Starward Rogue\StarwardRogue_Data\Managed\Steamworks.NET.dll into Unity Child Domain
Platform assembly: C:\Steam\steamapps\common\Starward Rogue\StarwardRogue_Data\Managed\Steamworks.NET.dll (this message is harmless)
Loading C:\Steam\steamapps\common\Starward Rogue\StarwardRogue_Data\Managed\Steamworks.NET.dll into Unity Child Domain
Platform assembly: C:\Steam\steamapps\common\Starward Rogue\StarwardRogue_Data\Managed\System.dll (this message is harmless)
Platform assembly: C:\Steam\steamapps\common\Starward Rogue\StarwardRogue_Data\Managed\System.Core.dll (this message is harmless)
- Completed reload, in  0.137 seconds
WARNING: Shader Unsupported: 'Hidden/VR/BlitCopyFromTexArray' - Pass '' has no vertex shader
WARNING: Shader Unsupported: 'Hidden/VR/BlitCopyFromTexArray' - Setting to default shader.
<RI> Initializing input.

<RI> Input initialized.

<RI> Initialized touch support.

UnloadTime: 1.254397 ms
Fallback handler could not load library C:/Steam/steamapps/common/Starward Rogue/StarwardRogue_Data/Mono/XInputInterface64
Fallback handler could not load library C:/Steam/steamapps/common/Starward Rogue/StarwardRogue_Data/Mono/.\XInputInterface64
Fallback handler could not load library C:/Steam/steamapps/common/Starward Rogue/StarwardRogue_Data/Mono/XInputInterface64
Fallback handler could not load library C:/Steam/steamapps/common/Starward Rogue/StarwardRogue_Data/Mono/libXInputInterface64
Fallback handler could not load library C:/Steam/steamapps/common/Starward Rogue/StarwardRogue_Data/Mono/.\libXInputInterface64
Fallback handler could not load library C:/Steam/steamapps/common/Starward Rogue/StarwardRogue_Data/Mono/libXInputInterface64
Steamworks Init
 
(Filename: C:/buildslave/unity/build/artifacts/generated/common/runtime/DebugBindings.gen.cpp Line: 51)

Steamworks IsRunning: True
 
(Filename: C:/buildslave/unity/build/artifacts/generated/common/runtime/DebugBindings.gen.cpp Line: 51)

graphicsShaderLevel:30
graphicsDeviceID:22802
graphicsDeviceName:Intel(R) HD Graphics 630
graphicsDeviceVendor:Intel
graphicsDeviceVendorID:32902
graphicsDeviceVersion:Direct3D 9.0c [igdumdim32.dll 23.20.16.4973]
graphicsMemorySize:2111
graphicsMultiThreaded:True
operatingSystem:Windows 10  (10.0.0) 64bit
processorCount:4
processorType:Intel(R) Core(TM) i5-7400T CPU @ 2.40GHz
processorFrequency:2400 mHz
supportsImageEffects:True
supportsShadows:True
maxTextureSize:8192
npotSupport:Full
systemMemorySize:8084
 
(Filename: C:/buildslave/unity/build/artifacts/generated/common/runtime/DebugBindings.gen.cpp Line: 51)

Platform assembly: C:\Steam\steamapps\common\Starward Rogue\StarwardRogue_Data\Managed\System.Xml.dll (this message is harmless)
Steamworks Init
 
(Filename: C:/buildslave/unity/build/artifacts/generated/common/runtime/DebugBindings.gen.cpp Line: 51)

Steamworks IsRunning: True
 
(Filename: C:/buildslave/unity/build/artifacts/generated/common/runtime/DebugBindings.gen.cpp Line: 51)

GameInit (0 - 6/21/2018 6:01:14 AM)
 
(Filename: C:/buildslave/unity/build/artifacts/generated/common/runtime/DebugBindings.gen.cpp Line: 51)

Expansion 1 music installed.
 
(Filename: C:/buildslave/unity/build/artifacts/generated/common/runtime/DebugBindings.gen.cpp Line: 51)

GameInit (1 - 6/21/2018 6:01:25 AM)
 
(Filename: C:/buildslave/unity/build/artifacts/generated/common/runtime/DebugBindings.gen.cpp Line: 51)

Version: 2.004
 
(Filename: C:/buildslave/unity/build/artifacts/generated/common/runtime/DebugBindings.gen.cpp Line: 51)

SoundsFromMods sound file count: 1
 
(Filename: C:/buildslave/unity/build/artifacts/generated/common/runtime/DebugBindings.gen.cpp Line: 51)

SoundsFromMods sound loading finished
 
(Filename: C:/buildslave/unity/build/artifacts/generated/common/runtime/DebugBindings.gen.cpp Line: 51)

GameInit (2 - 6/21/2018 6:01:29 AM)
 
(Filename: C:/buildslave/unity/build/artifacts/generated/common/runtime/DebugBindings.gen.cpp Line: 51)

GameInit (3 - 6/21/2018 6:01:30 AM)
 
(Filename: C:/buildslave/unity/build/artifacts/generated/common/runtime/DebugBindings.gen.cpp Line: 51)

DynamicHeapAllocator allocation probe 1 failed - Could not get memory for large allocation 2097156.
d3d: failed to create 2D texture id=10137 w=576 h=576 mips=1 d3dfmt=21 [out of memory]
d3d: failed to create 2D texture id=10139 w=576 h=576 mips=1 d3dfmt=21 [out of memory]
DynamicHeapAllocator allocation probe 2 failed - Could not get memory for large allocation 2097156.
DynamicHeapAllocator allocation probe 3 failed - Could not get memory for large allocation 2097156.
DynamicHeapAllocator allocation probe 4 failed - Could not get memory for large allocation 2097156.
DynamicHeapAllocator out of memory - Could not get memory for large allocation 2097156!
Could not allocate memory: System out of memory!
Trying to allocate: 2097156B with 16 alignment. MemoryLabel: Texture
Allocation happend at: Line:475 in 
Memory overview

[ ALLOC_DEFAULT ] used: 321410732B | peak: 0B | reserved: 330180876B 
[ ALLOC_TEMP_JOB ] used: 0B | peak: 0B | reserved: 3145728B 
[ ALLOC_GFX ] used: 1373211468B | peak: 0B | reserved: 1385873704B 
[ ALLOC_CACHEOBJECTS ] used: 427168B | peak: 0B | reserved: 10485760B 
[ ALLOC_TYPETREE ] used: 0B | peak: 0B | reserved: 0B 
[ ALLOC_PROFILER ] used: 0B | peak: 0B | reserved: 0B 
[ ALLOC_TEMP_THREAD ] used: 32768B | peak: 0B | reserved: 3112960B 
Could not allocate memory: System out of memory!
Trying to allocate: 2097156B with 16 alignment. MemoryLabel: Texture
Allocation happend at: Line:475 in 
Memory overview

[ ALLOC_DEFAULT ] used: 321410732B | peak: 0B | reserved: 330180876B 
[ ALLOC_TEMP_JOB ] used: 0B | peak: 0B | reserved: 3145728B 
[ ALLOC_GFX ] used: 1373211468B | peak: 0B | reserved: 1385873704B 
[ ALLOC_CACHEOBJECTS ] used: 427168B | peak: 0B | reserved: 10485760B 
[ ALLOC_TYPETREE ] used: 0B | peak: 0B | reserved: 0B 
[ ALLOC_PROFILER ] used: 0B | peak: 0B | reserved: 0B 
[ ALLOC_TEMP_THREAD ] used: 32768B | peak: 0B | reserved: 3112960B 

 
(Filename:  Line: 1045)

Crash!!!
SymInit: Symbol-SearchPath: '.;C:\Steam\steamapps\common\Starward Rogue;C:\Steam\steamapps\common\Starward Rogue;C:\WINDOWS;C:\WINDOWS\system32;SRV*C:\websymbols*http://msdl.microsoft.com/download/symbols;', symOptions: 530, UserName: 'gmivb'
OS-Version: 10.0.17134 () 0x100-0x1
C:\Steam\steamapps\common\Starward Rogue\StarwardRogue.exe:StarwardRogue.exe (00140000), size: 19247104 (result: 0), SymType: '-exported-', PDB: 'C:\Steam\steamapps\common\Starward Rogue\StarwardRogue.exe', fileVersion: 2017.1.0.11279
C:\WINDOWS\SYSTEM32\ntdll.dll:ntdll.dll (77E40000), size: 1638400 (result: 0), SymType: '-exported-', PDB: 'C:\WINDOWS\SYSTEM32\ntdll.dll', fileVersion: 10.0.17134.112
C:\WINDOWS\System32\KERNEL32.DLL:KERNEL32.DLL (763B0000), size: 917504 (result: 0), SymType: '-exported-', PDB: 'C:\WINDOWS\System32\KERNEL32.DLL', fileVersion: 10.0.17134.1
C:\WINDOWS\System32\KERNELBASE.dll:KERNELBASE.dll (77780000), size: 1982464 (result: 0), SymType: '-exported-', PDB: 'C:\WINDOWS\System32\KERNELBASE.dll', fileVersion: 10.0.17134.112
C:\WINDOWS\System32\USER32.dll:USER32.dll (76A30000), size: 1626112 (result: 0), SymType: '-exported-', PDB: 'C:\WINDOWS\System32\USER32.dll', fileVersion: 10.0.17134.1
C:\WINDOWS\System32\win32u.dll:win32u.dll (767C0000), size: 94208 (result: 0), SymType: '-exported-', PDB: 'C:\WINDOWS\System32\win32u.dll', fileVersion: 10.0.17134.1
C:\WINDOWS\SYSTEM32\HID.DLL:HID.DLL (6A1B0000), size: 40960 (result: 0), SymType: '-exported-', PDB: 'C:\WINDOWS\SYSTEM32\HID.DLL', fileVersion: 10.0.17134.1
C:\WINDOWS\System32\GDI32.dll:GDI32.dll (75A90000), size: 139264 (result: 0), SymType: '-nosymbols-', PDB: 'C:\WINDOWS\System32\GDI32.dll', fileVersion: 10.0.17134.1
C:\WINDOWS\System32\msvcrt.dll:msvcrt.dll (776C0000), size: 782336 (result: 0), SymType: '-nosymbols-', PDB: 'C:\WINDOWS\System32\msvcrt.dll', fileVersion: 7.0.17134.1
C:\WINDOWS\System32\gdi32full.dll:gdi32full.dll (76520000), size: 1458176 (result: 0), SymType: '-nosymbols-', PDB: 'C:\WINDOWS\System32\gdi32full.dll', fileVersion: 10.0.17134.112
C:\WINDOWS\System32\msvcp_win.dll:msvcp_win.dll (76070000), size: 512000 (result: 0), SymType: '-nosymbols-', PDB: 'C:\WINDOWS\System32\msvcp_win.dll', fileVersion: 10.0.17134.1
C:\WINDOWS\System32\ucrtbase.dll:ucrtbase.dll (779A0000), size: 1171456 (result: 0), SymType: '-nosymbols-', PDB: 'C:\WINDOWS\System32\ucrtbase.dll', fileVersion: 10.0.17134.1
C:\WINDOWS\System32\ole32.dll:ole32.dll (761E0000), size: 1032192 (result: 0), SymType: '-exported-', PDB: 'C:\WINDOWS\System32\ole32.dll', fileVersion: 10.0.17134.1
C:\WINDOWS\System32\combase.dll:combase.dll (75C60000), size: 2473984 (result: 0), SymType: '-exported-', PDB: 'C:\WINDOWS\System32\combase.dll', fileVersion: 10.0.17134.112
C:\WINDOWS\System32\RPCRT4.dll:RPCRT4.dll (771D0000), size: 786432 (result: 0), SymType: '-nosymbols-', PDB: 'C:\WINDOWS\System32\RPCRT4.dll', fileVersion: 10.0.17134.112
C:\WINDOWS\SYSTEM32\VERSION.dll:VERSION.dll (74600000), size: 32768 (result: 0), SymType: '-exported-', PDB: 'C:\WINDOWS\SYSTEM32\VERSION.dll', fileVersion: 10.0.17134.1
C:\WINDOWS\System32\SspiCli.dll:SspiCli.dll (74700000), size: 131072 (result: 0), SymType: '-exported-', PDB: 'C:\WINDOWS\System32\SspiCli.dll', fileVersion: 10.0.17134.1
C:\WINDOWS\System32\CRYPTBASE.dll:CRYPTBASE.dll (746F0000), size: 40960 (result: 0), SymType: '-exported-', PDB: 'C:\WINDOWS\System32\CRYPTBASE.dll', fileVersion: 10.0.17134.1
C:\WINDOWS\System32\bcryptPrimitives.dll:bcryptPrimitives.dll (762E0000), size: 360448 (result: 0), SymType: '-exported-', PDB: 'C:\WINDOWS\System32\bcryptPrimitives.dll', fileVersion: 10.0.17134.112
C:\WINDOWS\System32\sechost.dll:sechost.dll (75AE0000), size: 278528 (result: 0), SymType: '-nosymbols-', PDB: 'C:\WINDOWS\System32\sechost.dll', fileVersion: 10.0.17134.1
C:\WINDOWS\System32\SHLWAPI.dll:SHLWAPI.dll (77180000), size: 282624 (result: 0), SymType: '-nosymbols-', PDB: 'C:\WINDOWS\System32\SHLWAPI.dll', fileVersion: 10.0.17134.1
C:\WINDOWS\System32\SETUPAPI.dll:SETUPAPI.dll (77290000), size: 4370432 (result: 0), SymType: '-nosymbols-', PDB: 'C:\WINDOWS\System32\SETUPAPI.dll', fileVersion: 10.0.17134.1
C:\WINDOWS\System32\cfgmgr32.dll:cfgmgr32.dll (76770000), size: 233472 (result: 0), SymType: '-nosymbols-', PDB: 'C:\WINDOWS\System32\cfgmgr32.dll', fileVersion: 10.0.17134.1
C:\WINDOWS\System32\ADVAPI32.dll:ADVAPI32.dll (766F0000), size: 491520 (result: 0), SymType: '-nosymbols-', PDB: 'C:\WINDOWS\System32\ADVAPI32.dll', fileVersion: 10.0.17134.1
C:\WINDOWS\System32\SHELL32.dll:SHELL32.dll (74720000), size: 20226048 (result: 0), SymType: '-nosymbols-', PDB: 'C:\WINDOWS\System32\SHELL32.dll', fileVersion: 10.0.17134.81
C:\WINDOWS\System32\shcore.dll:shcore.dll (77B20000), size: 557056 (result: 0), SymType: '-exported-', PDB: 'C:\WINDOWS\System32\shcore.dll', fileVersion: 10.0.17134.112
C:\WINDOWS\System32\windows.storage.dll:windows.storage.dll (76BC0000), size: 6004736 (result: 0), SymType: '-nosymbols-', PDB: 'C:\WINDOWS\System32\windows.storage.dll', fileVersion: 10.0.17134.81
C:\WINDOWS\System32\kernel.appcore.dll:kernel.appcore.dll (75AD0000), size: 61440 (result: 0), SymType: '-nosymbols-', PDB: 'C:\WINDOWS\System32\kernel.appcore.dll', fileVersion: 10.0.17134.112
C:\WINDOWS\System32\profapi.dll:profapi.dll (75A70000), size: 98304 (result: 0), SymType: '-nosymbols-', PDB: 'C:\WINDOWS\System32\profapi.dll', fileVersion: 10.0.17134.1
C:\WINDOWS\System32\powrprof.dll:powrprof.dll (76350000), size: 282624 (result: 0), SymType: '-exported-', PDB: 'C:\WINDOWS\System32\powrprof.dll', fileVersion: 10.0.17134.1
C:\WINDOWS\System32\FLTLIB.DLL:FLTLIB.DLL (76690000), size: 32768 (result: 0), SymType: '-exported-', PDB: 'C:\WINDOWS\System32\FLTLIB.DLL', fileVersion: 10.0.17134.1
C:\WINDOWS\System32\WS2_32.dll:WS2_32.dll (760F0000), size: 421888 (result: 0), SymType: '-exported-', PDB: 'C:\WINDOWS\System32\WS2_32.dll', fileVersion: 10.0.17134.1
C:\WINDOWS\System32\OLEAUT32.dll:OLEAUT32.dll (75BC0000), size: 614400 (result: 0), SymType: '-exported-', PDB: 'C:\WINDOWS\System32\OLEAUT32.dll', fileVersion: 10.0.17134.48
C:\WINDOWS\SYSTEM32\OPENGL32.dll:OPENGL32.dll (6B3E0000), size: 888832 (result: 0), SymType: '-exported-', PDB: 'C:\WINDOWS\SYSTEM32\OPENGL32.dll', fileVersion: 10.0.17134.1
C:\WINDOWS\System32\IMM32.dll:IMM32.dll (77970000), size: 155648 (result: 0), SymType: '-exported-', PDB: 'C:\WINDOWS\System32\IMM32.dll', fileVersion: 10.0.17134.1
C:\WINDOWS\SYSTEM32\WINMM.dll:WINMM.dll (6B980000), size: 147456 (result: 0), SymType: '-exported-', PDB: 'C:\WINDOWS\SYSTEM32\WINMM.dll', fileVersion: 10.0.17134.1
C:\WINDOWS\SYSTEM32\GLU32.dll:GLU32.dll (6A9F0000), size: 258048 (result: 0), SymType: '-exported-', PDB: 'C:\WINDOWS\SYSTEM32\GLU32.dll', fileVersion: 10.0.17134.1
C:\WINDOWS\SYSTEM32\DNSAPI.dll:DNSAPI.dll (70E60000), size: 581632 (result: 0), SymType: '-exported-', PDB: 'C:\WINDOWS\SYSTEM32\DNSAPI.dll', fileVersion: 10.0.17134.1
C:\WINDOWS\SYSTEM32\IPHLPAPI.DLL:IPHLPAPI.DLL (70EF0000), size: 196608 (result: 0), SymType: '-nosymbols-', PDB: 'C:\WINDOWS\SYSTEM32\IPHLPAPI.DLL', fileVersion: 10.0.17134.1
C:\WINDOWS\System32\NSI.dll:NSI.dll (75AC0000), size: 28672 (result: 0), SymType: '-exported-', PDB: 'C:\WINDOWS\System32\NSI.dll', fileVersion: 10.0.17134.1
C:\WINDOWS\SYSTEM32\WINHTTP.dll:WINHTTP.dll (6DF30000), size: 720896 (result: 0), SymType: '-nosymbols-', PDB: 'C:\WINDOWS\SYSTEM32\WINHTTP.dll', fileVersion: 10.0.17134.1
C:\WINDOWS\SYSTEM32\WINMMBASE.dll:WINMMBASE.dll (6B3B0000), size: 143360 (result: 0), SymType: '-nosymbols-', PDB: 'C:\WINDOWS\SYSTEM32\WINMMBASE.dll', fileVersion: 10.0.17134.1
C:\Steam\gameoverlayrenderer.dll:gameoverlayrenderer.dll (5D350000), size: 1327104 (result: 0), SymType: '-nosymbols-', PDB: 'C:\Steam\gameoverlayrenderer.dll', fileVersion: 4.55.34.56
C:\WINDOWS\System32\PSAPI.DLL:PSAPI.DLL (763A0000), size: 24576 (result: 0), SymType: '-nosymbols-', PDB: 'C:\WINDOWS\System32\PSAPI.DLL', fileVersion: 10.0.17134.1
C:\WINDOWS\system32\uxtheme.dll:uxtheme.dll (6C850000), size: 507904 (result: 0), SymType: '-nosymbols-', PDB: 'C:\WINDOWS\system32\uxtheme.dll', fileVersion: 10.0.17134.1
C:\Steam\steamapps\common\Starward Rogue\StarwardRogue_Data\Mono\EmbedRuntime\mono.dll:mono.dll (10000000), size: 2289664 (result: 0), SymType: '-nosymbols-', PDB: 'C:\Steam\steamapps\common\Starward Rogue\StarwardRogue_Data\Mono\EmbedRuntime\mono.dll', fileVersion: 1.0.0.1
C:\WINDOWS\SYSTEM32\MSWSOCK.dll:MSWSOCK.dll (70DB0000), size: 352256 (result: 0), SymType: '-nosymbols-', PDB: 'C:\WINDOWS\SYSTEM32\MSWSOCK.dll', fileVersion: 10.0.17134.1
C:\WINDOWS\System32\MSCTF.dll:MSCTF.dll (75EC0000), size: 1327104 (result: 0), SymType: '-nosymbols-', PDB: 'C:\WINDOWS\System32\MSCTF.dll', fileVersion: 10.0.17134.1
C:\WINDOWS\system32\dwmapi.dll:dwmapi.dll (6C820000), size: 143360 (result: 0), SymType: '-nosymbols-', PDB: 'C:\WINDOWS\system32\dwmapi.dll', fileVersion: 10.0.17134.1
C:\WINDOWS\SYSTEM32\d3d9.dll:d3d9.dll (64160000), size: 1503232 (result: 0), SymType: '-nosymbols-', PDB: 'C:\WINDOWS\SYSTEM32\d3d9.dll', fileVersion: 10.0.17134.81
C:\WINDOWS\System32\DriverStore\FileRepository\igdlh64.inf_amd64_bc75cebf5edbbc50\igdumdim32.dll:igdumdim32.dll (5D1A0000), size: 1716224 (result: 0), SymType: '-nosymbols-', PDB: 'C:\WINDOWS\System32\DriverStore\FileRepository\igdlh64.inf_amd64_bc75cebf5edbbc50\igdumdim32.dll', fileVersion: 23.20.16.4973
C:\WINDOWS\System32\DriverStore\FileRepository\igdlh64.inf_amd64_bc75cebf5edbbc50\igd9dxva32.dll:igd9dxva32.dll (5D8A0000), size: 48836608 (result: 0), SymType: '-nosymbols-', PDB: 'C:\WINDOWS\System32\DriverStore\FileRepository\igdlh64.inf_amd64_bc75cebf5edbbc50\igd9dxva32.dll', fileVersion: 23.20.16.4973
C:\WINDOWS\System32\DriverStore\FileRepository\igdlh64.inf_amd64_bc75cebf5edbbc50\igc32.dll:igc32.dll (5B7A0000), size: 27205632 (result: 0), SymType: '-nosymbols-', PDB: 'C:\WINDOWS\System32\DriverStore\FileRepository\igdlh64.inf_amd64_bc75cebf5edbbc50\igc32.dll', fileVersion: 23.20.16.4973
C:\WINDOWS\System32\clbcatq.dll:clbcatq.dll (75B30000), size: 536576 (result: 0), SymType: '-nosymbols-', PDB: 'C:\WINDOWS\System32\clbcatq.dll', fileVersion: 2001.12.10941.16384
C:\WINDOWS\System32\MMDevApi.dll:MMDevApi.dll (62DA0000), size: 376832 (result: 0), SymType: '-nosymbols-', PDB: 'C:\WINDOWS\System32\MMDevApi.dll', fileVersion: 10.0.17134.1
C:\WINDOWS\System32\DEVOBJ.dll:DEVOBJ.dll (70D80000), size: 139264 (result: 0), SymType: '-nosymbols-', PDB: 'C:\WINDOWS\System32\DEVOBJ.dll', fileVersion: 10.0.17134.1
C:\WINDOWS\System32\PROPSYS.dll:PROPSYS.dll (6EA30000), size: 1572864 (result: 0), SymType: '-nosymbols-', PDB: 'C:\WINDOWS\System32\PROPSYS.dll', fileVersion: 7.0.17134.112
C:\WINDOWS\SYSTEM32\wdmaud.drv:wdmaud.drv (61D20000), size: 241664 (result: 0), SymType: '-nosymbols-', PDB: 'C:\WINDOWS\SYSTEM32\wdmaud.drv', fileVersion: 10.0.17134.1
C:\WINDOWS\SYSTEM32\AVRT.dll:AVRT.dll (62F00000), size: 32768 (result: 0), SymType: '-nosymbols-', PDB: 'C:\WINDOWS\SYSTEM32\AVRT.dll', fileVersion: 10.0.17134.1
C:\WINDOWS\SYSTEM32\ksuser.dll:ksuser.dll (63930000), size: 28672 (result: 0), SymType: '-nosymbols-', PDB: 'C:\WINDOWS\SYSTEM32\ksuser.dll', fileVersion: 10.0.17134.1
C:\WINDOWS\SYSTEM32\AUDIOSES.DLL:AUDIOSES.DLL (62E00000), size: 1028096 (result: 0), SymType: '-nosymbols-', PDB: 'C:\WINDOWS\SYSTEM32\AUDIOSES.DLL', fileVersion: 10.0.17134.112
C:\WINDOWS\SYSTEM32\wintypes.dll:wintypes.dll (6D550000), size: 876544 (result: 0), SymType: '-nosymbols-', PDB: 'C:\WINDOWS\SYSTEM32\wintypes.dll', fileVersion: 10.0.17134.112
C:\WINDOWS\SYSTEM32\msacm32.drv:msacm32.drv (61D10000), size: 40960 (result: 0), SymType: '-nosymbols-', PDB: 'C:\WINDOWS\SYSTEM32\msacm32.drv', fileVersion: 10.0.17134.1
C:\WINDOWS\SYSTEM32\MSACM32.dll:MSACM32.dll (61CF0000), size: 102400 (result: 0), SymType: '-nosymbols-', PDB: 'C:\WINDOWS\SYSTEM32\MSACM32.dll', fileVersion: 10.0.17134.1
C:\WINDOWS\SYSTEM32\midimap.dll:midimap.dll (61CE0000), size: 32768 (result: 0), SymType: '-nosymbols-', PDB: 'C:\WINDOWS\SYSTEM32\midimap.dll', fileVersion: 10.0.17134.1
C:\WINDOWS\SYSTEM32\xinput1_3.dll:xinput1_3.dll (11E30000), size: 90112 (result: 0), SymType: '-nosymbols-', PDB: 'C:\WINDOWS\SYSTEM32\xinput1_3.dll', fileVersion: 9.18.944.0
C:\WINDOWS\SYSTEM32\TextInputFramework.dll:TextInputFramework.dll (6C7A0000), size: 516096 (result: 0), SymType: '-nosymbols-', PDB: 'C:\WINDOWS\SYSTEM32\TextInputFramework.dll', fileVersion: 10.0.17134.1
C:\WINDOWS\SYSTEM32\CoreUIComponents.dll:CoreUIComponents.dll (6C540000), size: 2478080 (result: 0), SymType: '-nosymbols-', PDB: 'C:\WINDOWS\SYSTEM32\CoreUIComponents.dll', fileVersion: 10.0.17134.112
C:\WINDOWS\SYSTEM32\CoreMessaging.dll:CoreMessaging.dll (6C4B0000), size: 569344 (result: 0), SymType: '-nosymbols-', PDB: 'C:\WINDOWS\SYSTEM32\CoreMessaging.dll', fileVersion: 10.0.17134.112
C:\WINDOWS\SYSTEM32\ntmarta.dll:ntmarta.dll (6CE10000), size: 167936 (result: 0), SymType: '-nosymbols-', PDB: 'C:\WINDOWS\SYSTEM32\ntmarta.dll', fileVersion: 10.0.17134.1
C:\WINDOWS\system32\wbem\wbemprox.dll:wbemprox.dll (6E500000), size: 53248 (result: 0), SymType: '-nosymbols-', PDB: 'C:\WINDOWS\system32\wbem\wbemprox.dll', fileVersion: 10.0.17134.1
C:\WINDOWS\SYSTEM32\wbemcomn.dll:wbemcomn.dll (6E510000), size: 438272 (result: 0), SymType: '-nosymbols-', PDB: 'C:\WINDOWS\SYSTEM32\wbemcomn.dll', fileVersion: 10.0.17134.1
C:\WINDOWS\SYSTEM32\bcrypt.dll:bcrypt.dll (70F70000), size: 102400 (result: 0), SymType: '-nosymbols-', PDB: 'C:\WINDOWS\SYSTEM32\bcrypt.dll', fileVersion: 10.0.17134.112
C:\WINDOWS\system32\wbem\wbemsvc.dll:wbemsvc.dll (6E4F0000), size: 65536 (result: 0), SymType: '-nosymbols-', PDB: 'C:\WINDOWS\system32\wbem\wbemsvc.dll', fileVersion: 10.0.17134.1
C:\WINDOWS\system32\wbem\fastprox.dll:fastprox.dll (6E420000), size: 798720 (result: 0), SymType: '-nosymbols-', PDB: 'C:\WINDOWS\system32\wbem\fastprox.dll', fileVersion: 10.0.17134.1
C:\WINDOWS\SYSTEM32\CRYPTSP.dll:CRYPTSP.dll (70F50000), size: 77824 (result: 0), SymType: '-nosymbols-', PDB: 'C:\WINDOWS\SYSTEM32\CRYPTSP.dll', fileVersion: 10.0.17134.1
C:\WINDOWS\system32\rsaenh.dll:rsaenh.dll (70F20000), size: 192512 (result: 0), SymType: '-nosymbols-', PDB: 'C:\WINDOWS\system32\rsaenh.dll', fileVersion: 10.0.17134.1
C:\WINDOWS\SYSTEM32\dhcpcsvc6.DLL:dhcpcsvc6.DLL (70E40000), size: 77824 (result: 0), SymType: '-nosymbols-', PDB: 'C:\WINDOWS\SYSTEM32\dhcpcsvc6.DLL', fileVersion: 10.0.17134.1
C:\WINDOWS\SYSTEM32\dhcpcsvc.DLL:dhcpcsvc.DLL (70E20000), size: 81920 (result: 0), SymType: '-nosymbols-', PDB: 'C:\WINDOWS\SYSTEM32\dhcpcsvc.DLL', fileVersion: 10.0.17134.1
C:\Windows\System32\rasadhlp.dll:rasadhlp.dll (6E620000), size: 32768 (result: 0), SymType: '-nosymbols-', PDB: 'C:\Windows\System32\rasadhlp.dll', fileVersion: 10.0.17134.1
C:\Steam\steamapps\common\Starward Rogue\StarwardRogue_Data\Plugins\XInputInterface32.dll:XInputInterface32.dll (60750000), size: 77824 (result: 0), SymType: '-nosymbols-', PDB: 'C:\Steam\steamapps\common\Starward Rogue\StarwardRogue_Data\Plugins\XInputInterface32.dll'
C:\WINDOWS\System32\WINTRUST.dll:WINTRUST.dll (766A0000), size: 290816 (result: 0), SymType: '-nosymbols-', PDB: 'C:\WINDOWS\System32\WINTRUST.dll', fileVersion: 10.0.17134.81
C:\WINDOWS\System32\MSASN1.dll:MSASN1.dll (76340000), size: 57344 (result: 0), SymType: '-nosymbols-', PDB: 'C:\WINDOWS\System32\MSASN1.dll', fileVersion: 10.0.17134.1
C:\WINDOWS\System32\CRYPT32.dll:CRYPT32.dll (77BB0000), size: 1662976 (result: 0), SymType: '-nosymbols-', PDB: 'C:\WINDOWS\System32\CRYPT32.dll', fileVersion: 10.0.17134.1
C:\WINDOWS\System32\fwpuclnt.dll:fwpuclnt.dll (6E5D0000), size: 323584 (result: 0), SymType: '-nosymbols-', PDB: 'C:\WINDOWS\System32\fwpuclnt.dll', fileVersion: 10.0.17134.1
C:\Steam\steamapps\common\Starward Rogue\StarwardRogue_Data\Plugins\CSteamworks.dll:CSteamworks.dll (5B770000), size: 135168 (result: 0), SymType: '-nosymbols-', PDB: 'C:\Steam\steamapps\common\Starward Rogue\StarwardRogue_Data\Plugins\CSteamworks.dll', fileVersion: 1.7.0.0
C:\Steam\steamapps\common\Starward Rogue\steam_api.dll:steam_api.dll (5B750000), size: 122880 (result: 0), SymType: '-nosymbols-', PDB: 'C:\Steam\steamapps\common\Starward Rogue\steam_api.dll', fileVersion: 2.19.34.93
C:\Steam\steamclient.dll:steamclient.dll (61D60000), size: 12300288 (result: 0), SymType: '-nosymbols-', PDB: 'C:\Steam\steamclient.dll', fileVersion: 4.55.34.56
C:\WINDOWS\System32\imagehlp.dll:imagehlp.dll (76160000), size: 102400 (result: 0), SymType: '-nosymbols-', PDB: 'C:\WINDOWS\System32\imagehlp.dll', fileVersion: 10.0.17134.1
C:\Steam\tier0_s.dll:tier0_s.dll (6B810000), size: 626688 (result: 0), SymType: '-nosymbols-', PDB: 'C:\Steam\tier0_s.dll', fileVersion: 4.55.34.56
C:\Steam\vstdlib_s.dll:vstdlib_s.dll (6B7B0000), size: 380928 (result: 0), SymType: '-nosymbols-', PDB: 'C:\Steam\vstdlib_s.dll', fileVersion: 4.55.34.56
C:\WINDOWS\SYSTEM32\Secur32.dll:Secur32.dll (6CEE0000), size: 40960 (result: 0), SymType: '-nosymbols-', PDB: 'C:\WINDOWS\SYSTEM32\Secur32.dll', fileVersion: 10.0.17134.1
C:\Steam\steam.dll:steam.dll (5B680000), size: 794624 (result: 0), SymType: '-nosymbols-', PDB: 'C:\Steam\steam.dll'
C:\Steam\Steam2.dll:Steam2.dll (5B3B0000), size: 2887680 (result: 0), SymType: '-nosymbols-', PDB: 'C:\Steam\Steam2.dll', fileVersion: 2.0.2117.156
C:\WINDOWS\system32\napinsp.dll:napinsp.dll (6DDA0000), size: 69632 (result: 0), SymType: '-nosymbols-', PDB: 'C:\WINDOWS\system32\napinsp.dll', fileVersion: 10.0.17134.1
C:\WINDOWS\system32\pnrpnsp.dll:pnrpnsp.dll (6DD80000), size: 90112 (result: 0), SymType: '-nosymbols-', PDB: 'C:\WINDOWS\system32\pnrpnsp.dll', fileVersion: 10.0.17134.1
C:\WINDOWS\system32\NLAapi.dll:NLAapi.dll (6DD60000), size: 77824 (result: 0), SymType: '-nosymbols-', PDB: 'C:\WINDOWS\system32\NLAapi.dll', fileVersion: 10.0.17134.1
C:\WINDOWS\System32\winrnr.dll:winrnr.dll (6DD50000), size: 49152 (result: 0), SymType: '-nosymbols-', PDB: 'C:\WINDOWS\System32\winrnr.dll', fileVersion: 10.0.17134.1
C:\Steam\DbgHelp.dll:DbgHelp.dll (5B290000), size: 1134592 (result: 0), SymType: '-nosymbols-', PDB: 'C:\Steam\DbgHelp.dll', fileVersion: 6.7.5.0
C:\Steam\CSERHelper.dll:CSERHelper.dll (5B260000), size: 135168 (result: 0), SymType: '-nosymbols-', PDB: 'C:\Steam\CSERHelper.dll', fileVersion: 4.50.0.0
C:\Windows\System32\Windows.UI.dll:Windows.UI.dll (61B70000), size: 888832 (result: 0), SymType: '-nosymbols-', PDB: 'C:\Windows\System32\Windows.UI.dll', fileVersion: 10.0.17134.1
C:\Windows\System32\InputHost.dll:InputHost.dll (6A1C0000), size: 368640 (result: 0), SymType: '-nosymbols-', PDB: 'C:\Windows\System32\InputHost.dll'

========== OUTPUTING STACK TRACE ==================

  ERROR: SymGetSymFromAddr64, GetLastError: 'Попытка обращения к неверному адресу.' (Address: 00F8CD95)
0x00F8CD95 (StarwardRogue) 
  ERROR: SymGetSymFromAddr64, GetLastError: 'Попытка обращения к неверному адресу.' (Address: 00A1CD10)
0x00A1CD10 (StarwardRogue) 
  ERROR: SymGetSymFromAddr64, GetLastError: 'Попытка обращения к неверному адресу.' (Address: 00A162C2)
0x00A162C2 (StarwardRogue) 
  ERROR: SymGetSymFromAddr64, GetLastError: 'Попытка обращения к неверному адресу.' (Address: 00A16359)
0x00A16359 (StarwardRogue) 
  ERROR: SymGetSymFromAddr64, GetLastError: 'Попытка обращения к неверному адресу.' (Address: 001A2AE6)
0x001A2AE6 (StarwardRogue) 
  ERROR: SymGetSymFromAddr64, GetLastError: 'Попытка обращения к неверному адресу.' (Address: 001A3D89)
0x001A3D89 (StarwardRogue) 
  ERROR: SymGetSymFromAddr64, GetLastError: 'Попытка обращения к неверному адресу.' (Address: 001A40B5)
0x001A40B5 (StarwardRogue) 
  ERROR: SymGetSymFromAddr64, GetLastError: 'Попытка обращения к неверному адресу.' (Address: 001A43BC)
0x001A43BC (StarwardRogue) 
  ERROR: SymGetSymFromAddr64, GetLastError: 'Попытка обращения к неверному адресу.' (Address: 009CED43)
0x009CED43 (StarwardRogue) 
0x0661ACE0 (Mono JIT Code) (wrapper managed-to-native) UnityEngine.ImageConversion:LoadImage (UnityEngine.Texture2D,byte[],bool)
0x0661AC9E (Mono JIT Code) UnityEngine.ImageConversion:LoadImage (UnityEngine.Texture2D,byte[])
0x255DADDC (Mono JIT Code) GameImage:FinishLoadTextureFromFileAsync ()
0x0665285C (Mono JIT Code) GameImage:CheckLoad ()
0x066516BC (Mono JIT Code) Game:UpdateStreaming ()
0x065F1923 (Mono JIT Code) ArcenMainCameraImplementations:MainUpdateLogic ()
0x065F1023 (Mono JIT Code) MainCameraLogic:Update ()
0x0657F041 (Mono JIT Code) (wrapper runtime-invoke) object:runtime_invoke_void__this__ (object,intptr,intptr,intptr)
  ERROR: SymGetSymFromAddr64, GetLastError: 'Попытка обращения к неверному адресу.' (Address: 100F1AE7)
0x100F1AE7 (mono) 
  ERROR: SymGetSymFromAddr64, GetLastError: 'Попытка обращения к неверному адресу.' (Address: 1005DAC3)
0x1005DAC3 (mono) 
  ERROR: SymGetSymFromAddr64, GetLastError: 'Попытка обращения к неверному адресу.' (Address: 00733FB0)
0x00733FB0 (StarwardRogue) 
  ERROR: SymGetSymFromAddr64, GetLastError: 'Попытка обращения к неверному адресу.' (Address: 00730792)
0x00730792 (StarwardRogue) 
  ERROR: SymGetSymFromAddr64, GetLastError: 'Попытка обращения к неверному адресу.' (Address: 005EB75E)
0x005EB75E (StarwardRogue) 
  ERROR: SymGetSymFromAddr64, GetLastError: 'Попытка обращения к неверному адресу.' (Address: 005F3191)
0x005F3191 (StarwardRogue) 
  ERROR: SymGetSymFromAddr64, GetLastError: 'Попытка обращения к неверному адресу.' (Address: 005F31A7)
0x005F31A7 (StarwardRogue) 
  ERROR: SymGetSymFromAddr64, GetLastError: 'Попытка обращения к неверному адресу.' (Address: 005CEE2C)
0x005CEE2C (StarwardRogue) 
  ERROR: SymGetSymFromAddr64, GetLastError: 'Попытка обращения к неверному адресу.' (Address: 001EDA1E)
0x001EDA1E (StarwardRogue) 
  ERROR: SymGetSymFromAddr64, GetLastError: 'Попытка обращения к неверному адресу.' (Address: 009FF3A8)
0x009FF3A8 (StarwardRogue) 
  ERROR: SymGetSymFromAddr64, GetLastError: 'Попытка обращения к неверному адресу.' (Address: 00F8241D)
0x00F8241D (StarwardRogue) 
0x763C8484 (KERNEL32) BaseThreadInitThunk
0x77EA2FEA (ntdll) RtlValidSecurityDescriptor
0x77EA2FBA (ntdll) RtlValidSecurityDescriptor

========== END OF STACKTRACE ===========

**** Crash! ****
output_log-4.txt (33,395 bytes)
floor6.jpg (214,079 bytes)
floor6.jpg (214,079 bytes)
floor1.jpg (295,497 bytes)
error-4.log (47,717 bytes)

patsancheg

Jun 21, 2018 1:01 am

reporter   ~0047568

floor6.jpg - it's actually from the beginning of floor 5 (I made a mistake naming the file)

x4000Bughunter

Jun 22, 2018 2:12 pm

administrator   ~0047569

This is very peculiar data. Everything you're reporting looks exactly as it should, RAM-wise. The amount of total and managed RAM increasing as you play is expected, as it doesn't preload all the images and so forth. However, you'll notice that it's not exactly a massive increase in RAM usage.

A 32bit program will die after about 3.2GB of RAM used by itself. A unity program will die after about 700 or 800 mb of managed RAM used. None of your numbers are close to that.

The other thing that kills unity programs is if they wind up having some of their RAM shuffled off to the pagefile or swap. But your RAM usage in general is only 49% at most. So there's no way that windows should be involving the pagefile at that point; that starts at 80-90%.

THAT said, your log file does have something new and interesting that I've never seen before:
DynamicHeapAllocator allocation probe 1 failed - Could not get memory for large allocation 2097156
and
Could not allocate memory: System out of memory!
Trying to allocate: 2097156B with 16 alignment. MemoryLabel: Texture

That leads me to google results like this: https://steamcommunity.com/app/423580/discussions/2/343787920122071508/

Note that the "large allocation" is just reading a 2MB texture from disk to RAM in order to show something new. And it's doing that when you have like 4GB of system RAM free, and loads of other space available. It's definitely not a memory leak in a traditional sense.

In the case of the link above, it was something strange with their windows install. That wouldn't surprise me in this case, since you're seeing the issue but it isn't seen by other players. There also was another case where someone just needed to update their graphics drivers, and that solved it. I wouldn't recommend having to reinstall your whole OS over one game, but if you're seeing this issue in other games as well... maybe.

Beyond that, in the short term all I can think of is the workaround you found yourself, of only going for a couple of floors at a time. That's super annoying, I know, but it seems to be a system-oriented issue. :/

patsancheg

Jun 23, 2018 11:43 am

reporter   ~0047570

I never had any problems with Bionic Dues or AI War: Fleet Command on this computer. And I remember having long 10 hour sessions of AI War with no issues. Even games using Unreal 4 engine run perfectly fine. Starward Rogue itself runs very smoothly without any lags or FPS drops, and then it just crashes.
I have Windows 10 Pro, just like the person from steam link you provided. Maybe the problem is somehow related to Win 10?

x4000Bughunter

Jun 25, 2018 10:15 am

administrator   ~0047573

I'm using windows 10 pro as well at this point, and we developed on a mix of windows 10 and 7 and OSX and Ubuntu. AI War loads a lot more data, and has far higher managed ram amounts. The size of texture space in starward rogue is much larger, though, than either of those other two games.

I'm also definitely not disputing that your computer is more than up to the task of running the game, by the way. Something funky is going down here, but since it's limited to one machine from what I can tell, it seems to be somehow machine-specific. I don't know what that would be, exactly, which is super frustrating for both of us, I know. But I suspect it's similar to the other person there. Something with how unity is allocating unmanaged memory for new textures past a certain amount of them when loading them directly from disk rather than an asset bundle would be my guess, but that's down in the deep black box of the engine and apparently hitting some rare... something... in the OS install.

patsancheg

Jun 27, 2018 5:25 pm

reporter   ~0047574

It looks like Unity engine crashes on Intel HD Graphics systems. I found something that is similar to my problem:
https://forum.unity.com/threads/crash-intel-hd-graphics.521515/
I have Intel HD Graphics 630.

x4000Bughunter

Jul 2, 2018 9:59 am

administrator   ~0047684

So, potentially you can use a command line argument of -force-opengl to solve the issue. Beyond that, we may need to upgrade the game to a later version of Unity once the 2018.2 version comes out of beta.

More info: https://forum.unity.com/threads/crash-d3d11-dll-caused-an-access-violation-0xc0000005-in-module-d3d11-dll-at-0033-ef656f40.431030/

Thanks for the sleuthing!

patsancheg

Jul 2, 2018 1:32 pm

reporter   ~0047706

What I did:
In Steam Library --> Right click Starward Rogue --> Properties --> Set launch options --> -force-opengl
Then I did a full run (floor 1-7), and I cleared the whole floor 7 to see if there will be any issues.
Everything worked fine and there were no crashes, so -force-opengl seems to solve my problem. I'll let you know if I get any crashes with -force-opengl.

floor7cleared.jpg (271,277 bytes)

x4000Bughunter

Jul 2, 2018 1:49 pm

administrator   ~0047707

Fantastic!! Thanks for confirming that that seems to work. :)

Issue History

Date Modified Username Field Change
Jun 4, 2018 8:06 am patsancheg New Issue
Jun 4, 2018 8:06 am patsancheg File Added: error.log
Jun 4, 2018 8:06 am patsancheg File Added: output_log.txt
Jun 5, 2018 1:47 pm logorouge Note Added: 0047555
Jun 5, 2018 1:57 pm patsancheg Note Added: 0047556
Jun 5, 2018 2:09 pm logorouge Note Added: 0047557
Jun 5, 2018 4:21 pm patsancheg File Added: error-2.log
Jun 5, 2018 4:21 pm patsancheg File Added: output_log-2.txt
Jun 5, 2018 4:21 pm patsancheg Note Added: 0047558
Jun 7, 2018 11:02 am patsancheg File Added: error-3.log
Jun 7, 2018 11:02 am patsancheg File Added: output_log-3.txt
Jun 7, 2018 11:02 am patsancheg Note Added: 0047559
Jun 11, 2018 11:16 am x4000Bughunter Note Added: 0047560
Jun 11, 2018 11:17 am x4000Bughunter Assigned To => x4000Bughunter
Jun 11, 2018 11:17 am x4000Bughunter Status new => assigned
Jun 13, 2018 6:09 am patsancheg Note Added: 0047563
Jun 20, 2018 11:52 am x4000Bughunter Note Added: 0047566
Jun 21, 2018 12:54 am patsancheg File Added: error-4.log
Jun 21, 2018 12:54 am patsancheg File Added: output_log-4.txt
Jun 21, 2018 12:54 am patsancheg File Added: floor1.jpg
Jun 21, 2018 12:54 am patsancheg File Added: floor6.jpg
Jun 21, 2018 12:54 am patsancheg Note Added: 0047567
Jun 21, 2018 1:01 am patsancheg Note Added: 0047568
Jun 22, 2018 2:12 pm x4000Bughunter Note Added: 0047569
Jun 23, 2018 11:43 am patsancheg Note Added: 0047570
Jun 25, 2018 10:15 am x4000Bughunter Note Added: 0047573
Jun 27, 2018 5:25 pm patsancheg Note Added: 0047574
Jul 2, 2018 9:59 am x4000Bughunter Note Added: 0047684
Jul 2, 2018 1:32 pm patsancheg File Added: floor7cleared.jpg
Jul 2, 2018 1:32 pm patsancheg Note Added: 0047706
Jul 2, 2018 1:49 pm x4000Bughunter Note Added: 0047707
Jul 2, 2018 1:50 pm x4000Bughunter Status assigned => resolved
Jul 2, 2018 1:50 pm x4000Bughunter Resolution open => fixed